4,5-Diethyl-4,5-bis-(4-tert-butylphenyl)-octane
- Formula: C32H50
- Molecular weight: 434.7394
- IUPAC Standard InChIKey: DTOQQIZHGNEYCR-UHFFFAOYSA-N
- CAS Registry Number: 85668-73-1
- Chemical structure:
View 3d structure (requires JavaScript / HTML 5) - Permanent link for this species. Use this link for bookmarking this species for future reference.

Gas phase thermochemistry data

Data compiled by: Hussein Y. Afeefy, Joel F. Liebman, and Stephen E. Stein
Quantity | Value | Units | Method | Reference | Comment |
---|---|---|---|---|---|
ΔfH°gas | -224. ± 4.6 | kJ/mol | Ccb | Kratt, Beckhaus, et al., 1983 | ΔHfussion = 8.2±0.1 kcal/mol at 119°C |

Condensed phase thermochemistry data

Data compiled as indicated in comments:
ALS - Hussein Y. Afeefy, Joel F. Liebman, and Stephen E. Stein
DH - Eugene S. Domalski and Elizabeth D. Hearing
Quantity | Value | Units | Method | Reference | Comment |
---|---|---|---|---|---|
ΔfH°solid | -406.8 ± 3.5 | kJ/mol | Ccb | Kratt, Beckhaus, et al., 1983 | ΔHfussion = 8.2±0.1 kcal/mol at 119°C; ALS |
Quantity | Value | Units | Method | Reference | Comment |
ΔcH°solid | -19331.3 ± 3.5 | kJ/mol | Ccb | Kratt, Beckhaus, et al., 1983 | ΔHfussion = 8.2±0.1 kcal/mol at 119°C; Corresponding ΔfHºsolid = -406.8 kJ/mol (simple calculation by NIST; no Washburn corrections); ALS |
Constant pressure heat capacity of solid
Cp,solid (J/mol*K) | Temperature (K) | Reference | Comment |
---|---|---|---|
618.5 | 298. | Kratt, Beckhaus, et al., 1983, 2 | Cp given as 0.340 cal/g*K.; DH |

Phase change data

Data compiled as indicated in comments:
ALS - Hussein Y. Afeefy, Joel F. Liebman, and Stephen E. Stein
DRB - Donald R. Burgess, Jr.
Quantity | Value | Units | Method | Reference | Comment |
---|---|---|---|---|---|
ΔsubH° | 182. | kJ/mol | E | Kratt, Beckhaus, et al., 1983 | ΔHfussion = 8.2±0.1 kcal/mol at 119°C; ALS |
ΔsubH° | 182.8 | kJ/mol | N/A | Kratt, Beckhaus, et al., 1983 | DRB |

References

Kratt, Beckhaus, et al., 1983
Kratt, G.; Beckhaus, H.D.; Bernlohr, W.; Ruchardt, C.,
Thermolabile kohlenwasserstoffe. XVII. Verbrennungsenthalpie und bildungsenthalpie von zehn sym.-tetraalkyl-1,2-diarylethanen,
Thermochim. Acta, 1983, 62, 279-194. [all data]
Kratt, Beckhaus, et al., 1983, 2
Kratt, G.; Beckhaus, H.D.; Bernioehr, W.; Ruechardt, C.,
Thermolabile hydrocarbons. XVII. Enthalpies of combustion and formation of ten sym-tetraalkyl-1,2-diarylethanes,
Thermochim. Acta, 1983, 62, 279-294. [all data]