Benzoic acid, 2-(4-methylbenzoyl)-
- Formula: C15H12O3
- Molecular weight: 240.2540
- IUPAC Standard InChIKey: ICQOWIXIHDDXDI-UHFFFAOYSA-N
- CAS Registry Number: 85-55-2
- Chemical structure:
View 3d structure (requires JavaScript / HTML 5) - Other names: Benzoic acid, o-(p-toluoyl)-; o-(p-Toluoyl)benzoic acid; 2-(p-Toluyl)benzoic acid; 2-(4-Methylbenzoyl)benzoic acid; 4'-Methylbenzophenone-2-carboxylic acid; 2-(p-Toluoyl)benzoic acid; p-Toluoyl-o-benzoic acid

Phase change data

Data compiled by: Thermodynamics Research Center, NIST Boulder Laboratories, Chris Muzny director
Quantity | Value | Units | Method | Reference | Comment |
---|---|---|---|---|---|
Tfus | 413.17 | K | N/A | Witschonke, 1954 | Uncertainty assigned by TRC = 0.3 K |
Tfus | 413.45 | K | N/A | Witschonke, 1954 | Uncertainty assigned by TRC = 0.2 K |

References

Witschonke, 1954
Witschonke, C.R.,
Freezing point and purity data for some organic compounds,
Anal. Chem., 1954, 26, 562-4. [all data]