Benzoic acid, 2-benzoyl-
- Formula: C14H10O3
- Molecular weight: 226.2274
- IUPAC Standard InChIKey: FGTYTUFKXYPTML-UHFFFAOYSA-N
- CAS Registry Number: 85-52-9
- Chemical structure:
View 3d structure (requires JavaScript / HTML 5) - Other names: Benzoic acid, o-benzoyl-; o-Benzoylbenzoic acid; Benzophenone-2-carboxylic acid; 2-Benzoylbenzoic acid; 2-Carboxybenzophenone; Benzophenone-2-carbonic acid; 2-Benzoquinonecarboxylic acid; o-Carboxybenzophenone; NSC 6646

Phase change data

Data compiled as indicated in comments:
BS - Robert L. Brown and Stephen E. Stein
TRC - Thermodynamics Research Center, NIST Boulder Laboratories, Chris Muzny director
Quantity | Value | Units | Method | Reference | Comment |
---|---|---|---|---|---|
Tboil | 534.2 | K | N/A | Aldrich Chemical Company Inc., 1990 | BS |
Quantity | Value | Units | Method | Reference | Comment |
Tfus | 401.95 | K | N/A | Witschonke, 1954 | Uncertainty assigned by TRC = 0.3 K; TRC |
Tfus | 402.25 | K | N/A | Witschonke, 1954 | Uncertainty assigned by TRC = 0.2 K; TRC |

References

Aldrich Chemical Company Inc., 1990
Aldrich Chemical Company Inc.,
Catalog Handbook of Fine Chemicals, Aldrich Chemical Company, Inc., Milwaukee WI, 1990, 1. [all data]
Witschonke, 1954
Witschonke, C.R.,
Freezing point and purity data for some organic compounds,
Anal. Chem., 1954, 26, 562-4. [all data]