cis-Oxolane-3,4-diol dinitrate
- Formula: C8H12O5
- Molecular weight: 188.1779
- IUPAC Standard InChIKey: UTLGQZBGMVTJJZ-UHFFFAOYSA-N
- CAS Registry Number: 85440-70-6
- Chemical structure:
View 3d structure (requires JavaScript / HTML 5) - Stereoisomers:

Condensed phase thermochemistry data

Data compiled by: Hussein Y. Afeefy, Joel F. Liebman, and Stephen E. Stein
Quantity | Value | Units | Method | Reference | Comment |
---|---|---|---|---|---|
ΔfH°liquid | -978.0 ± 3.7 | kJ/mol | Ccb | Eremenko, Korolev, et al., 1985 | |
Quantity | Value | Units | Method | Reference | Comment |
ΔcH°liquid | -3885.1 ± 3.7 | kJ/mol | Ccb | Eremenko, Korolev, et al., 1985 | Corresponding ΔfHºliquid = -978.0 kJ/mol (simple calculation by NIST; no Washburn corrections) |

References

Eremenko, Korolev, et al., 1985
Eremenko, L.T.; Korolev, A.M.; Berezina, L.I.; Kirpichev, E.P.; Rubtsov, Yu.I.; Sorokina, T.V.,
Synthesis and physicochemical properties of cis- and trans-oxolane-3,4-diol derivatives,
Bull. Acad. Sci. USSR, Div. Chem. Sci., 1985, 795-798. [all data]