Chlorfenac
- Formula: C8H5Cl3O2
- Molecular weight: 239.483
- IUPAC Standard InChIKey: QZXCCPZJCKEPSA-UHFFFAOYSA-N
- CAS Registry Number: 85-34-7
- Chemical structure:
View 3d structure (requires JavaScript / HTML 5) - Other names: Benzeneacetic acid, 2,3,6-trichloro-; Acetic acid, (2,3,6-trichlorophenyl)-; (2,3,6-Trichlorophenyl)acetic acid; Fenac; Fenatrol; TCPA; Fenae; Kanepar; Tri-fene; Tri-Fen; 2,3,6-Trichlorphenylessigsaeure; Kyselina 2,3,6-trichlorfenyloctova; 2,3,6-Trichlorobenzeneacetic acid; NSC 41931

Phase change data

Data compiled as indicated in comments:
TRC - Thermodynamics Research Center, NIST Boulder Laboratories, Chris Muzny director
AC - William E. Acree, Jr., James S. Chickos
Quantity | Value | Units | Method | Reference | Comment |
---|---|---|---|---|---|
Tfus | 433.50 | K | N/A | Donnelly, Drewes, et al., 1990 | Uncertainty assigned by TRC = 0.2 K; TRC |
Enthalpy of fusion
ΔfusH (kcal/mol) | Temperature (K) | Method | Reference | Comment |
---|---|---|---|---|
5.361 | 432.3 | DSC | Acree, 1991 | See also Donnelly, Drewes, et al., 1990, 2.; AC |

References

Donnelly, Drewes, et al., 1990
Donnelly, J.R.; Drewes, L.A.; Johnson, R.L.; Munslow, W.D.; Knapp, K.K.; Sovocool, G.W.,
Purity and heat of fusion data for environmental standards as determined by differential scanning calorimetry,
Thermochim. Acta, 1990, 167, 2, 155, https://doi.org/10.1016/0040-6031(90)80476-F
. [all data]
Acree, 1991
Acree, William E.,
Thermodynamic properties of organic compounds: enthalpy of fusion and melting point temperature compilation,
Thermochimica Acta, 1991, 189, 1, 37-56, https://doi.org/10.1016/0040-6031(91)87098-H
. [all data]
Donnelly, Drewes, et al., 1990, 2
Donnelly, J.R.; Drewes, L.A.; Johnson, R.L.; Munslow, W.D.; Knapp, K.K.; Sovocool, G.W.,
Purity and heat of fusion data for environmental standards as determined by differential scanning calorimetry,
Thermochimica Acta, 1990, 167, 2, 155-187, https://doi.org/10.1016/0040-6031(90)80476-F
. [all data]