2,4'-Dichlorobenzophenone
- Formula: C13H8Cl2O
- Molecular weight: 251.108
- IUPAC Standard InChIKey: YXMYPHLWXBXNFF-UHFFFAOYSA-N
- CAS Registry Number: 85-29-0
- Chemical structure:
View 3d structure (requires JavaScript / HTML 5) - Other names: Methanone, (2-chlorophenyl)(4-chlorophenyl)-; Benzophenone, 2,4'-dichloro-; o,p'-Dichlorobenzophenone; o,p-Dichlorobenzophenone

Phase change data

Data compiled by: Thermodynamics Research Center, NIST Boulder Laboratories, Chris Muzny director
Quantity | Value | Units | Method | Reference | Comment |
---|---|---|---|---|---|
Tfus | 338.80 | K | N/A | Donnelly, Drewes, et al., 1990 | Uncertainty assigned by TRC = 0.2 K |

References

Donnelly, Drewes, et al., 1990
Donnelly, J.R.; Drewes, L.A.; Johnson, R.L.; Munslow, W.D.; Knapp, K.K.; Sovocool, G.W.,
Purity and heat of fusion data for environmental standards as determined by differential scanning calorimetry,
Thermochim. Acta, 1990, 167, 2, 155, https://doi.org/10.1016/0040-6031(90)80476-F
. [all data]
Szmant and McGinnis, 1952
Szmant, H.H.; McGinnis, C.,
The absorption spectra of some diaryl ketones, hydrazones and azines,
J. Am. Chem. Soc., 1952, 74, 240-244. [all data]