cis-Bicyclo[4.3.0]-3-nonene
- Formula: C9H14
- Molecular weight: 122.2075
- IUPAC Standard InChIKey: UZURTQHPMXADGG-DTORHVGOSA-N
- CAS Registry Number: 85236-78-8
- Chemical structure:
View 3d structure (requires JavaScript / HTML 5) - Other names: 2,3,3a,4,7,7a-Hexahydro-1H-indene

Normal alkane RI, non-polar column, custom temperature program

Column type | Active phase | I | Reference | Comment |
---|---|---|---|---|
Capillary | Methyl Silicone | 1038. | Zenkevich, 2000 | Program: not specified |

References

Zenkevich, 2000
Zenkevich, I.G.,
Mutual Correlation between Gas Chromatographic Retention Indices of Unsaturated and Saturated Hydrocarbons found by Molecular Dynamics,
Z. Anal. Chem., 2000, 55, 10, 1091-1097. [all data]