1,6-Octadiene, 5,7-dimethyl-, (R)-
- Formula: C10H18
- Molecular weight: 138.2499
- IUPAC Standard InChIKey: FYZHLRMYDRUDES-SNVBAGLBSA-N
- CAS Registry Number: 85006-04-8
- Chemical structure:
View 3d structure (requires JavaScript / HTML 5) - Stereoisomers:
- Other names: R(+)5,7-Dimethyl-1,6-octadiene; 5,7-Dimethyl-1,6-octadiene, (R)-; Isocitronellene; 5,7-Dimethyl-1,6-octadiene; (R)-5,7-dimethylocta-1,6-diene

Van Den Dool and Kratz RI, non-polar column, temperature ramp

Column type | Active phase | I | Reference | Comment |
---|---|---|---|---|
Capillary | CP Sil 8 CB | 917. | Yassaa, Meklati, et al., 2000 | 25. m/0.2 mm/0.25 μm, 40. C @ 8. min, 2. K/min; Tend: 200. C |

Van Den Dool and Kratz RI, non-polar column, custom temperature program

Column type | Active phase | I | Reference | Comment |
---|---|---|---|---|
Capillary | DB-5 | 926. | Sampaio and Nogueira, 2006 | 30. m/0.25 mm/0.25 μm; Program: 40C(2min) => 4C/min => 220C => 20C/min => 280C |

Normal alkane RI, non-polar column, temperature ramp

Column type | Active phase | I | Reference | Comment |
---|---|---|---|---|
Capillary | Petrocol DH | 917. | Supelco, 2012 | 100. m/0.25 mm/0.50 μm, Helium, 20. C @ 15. min, 15. K/min, 220. C @ 30. min |

References

Yassaa, Meklati, et al., 2000
Yassaa, N.; Meklati, B.Y.; Cecinato, A.,
Evaluation of monoterpenic biogenic volatile organic compounds in ambient air around Eucalyptus globulus, Pinus halepensis and Cedrus atlantica trees growing in Algiers city area by chiral and achiral capillary gas chromatography,
Atmos. Environ., 2000, 34, 17, 2809-2816, https://doi.org/10.1016/S1352-2310(99)00436-7
. [all data]
Sampaio and Nogueira, 2006
Sampaio, T.S.; Nogueira, P.C.L.,
Volatile components of mangaba fruit (Hancornia speciosa Gomes) at three stages of maturity,
Food Chem., 2006, 95, 4, 606-610, https://doi.org/10.1016/j.foodchem.2005.01.038
. [all data]
Supelco, 2012
Supelco, CatalogNo. 24160-U,
Petrocol DH Columns. Catalog No. 24160-U, 2012, retrieved from http://www.sigmaaldrich.com/etc/medialib/docs/Supelco/Datasheet/1/w97949.Par.0001.File.tmp/w97949.pdf. [all data]