C8H13B
- Formula: C8H13B
- Molecular weight: 120.000
- CAS Registry Number: 84787-61-1

Reaction thermochemistry data

Data compiled by: John E. Bartmess
Individual Reactions
C8H12B- + = C8H13B
By formula: C8H12B- + H+ = C8H13B
Quantity | Value | Units | Method | Reference | Comment |
---|---|---|---|---|---|
ΔrH° | 369.0 ± 4.1 | kcal/mol | G+TS | Sullivan, 1977 | gas phase |
Quantity | Value | Units | Method | Reference | Comment |
ΔrG° | 362.2 ± 4.0 | kcal/mol | IMRB | Sullivan, 1977 | gas phase |

Gas phase ion energetics data

Data compiled by: John E. Bartmess
De-protonation reactions
C8H12B- + = C8H13B
By formula: C8H12B- + H+ = C8H13B
Quantity | Value | Units | Method | Reference | Comment |
---|---|---|---|---|---|
ΔrH° | 369.0 ± 4.1 | kcal/mol | G+TS | Sullivan, 1977 | gas phase |
Quantity | Value | Units | Method | Reference | Comment |
ΔrG° | 362.2 ± 4.0 | kcal/mol | IMRB | Sullivan, 1977 | gas phase |

References

Sullivan, 1977
Sullivan, S.A.,
Thesis, Cal. Inst. Tech. thesis,, 1977. [all data]