1,2-Benzenedicarboxylic acid, dihexyl ester
- Formula: C20H30O4
- Molecular weight: 334.4498
- IUPAC Standard InChIKey: KCXZNSGUUQJJTR-UHFFFAOYSA-N
- CAS Registry Number: 84-75-3
- Chemical structure:
View 3d structure (requires JavaScript / HTML 5) - Other names: Phthalic acid, dihexyl ester; Dihexyl phthalate; di-n-Hexyl phthalate; Dihexylester kyseliny ftalove

Phase change data

Data compiled as indicated in comments:
BS - Robert L. Brown and Stephen E. Stein
AC - William E. Acree, Jr., James S. Chickos
Reduced pressure boiling point
Tboil (K) | Pressure (bar) | Reference | Comment |
---|---|---|---|
458. to 461. | 0.0007 | Frinton Laboratories Inc., 1986 | BS |
Enthalpy of vaporization
ΔvapH (kJ/mol) | Temperature (K) | Method | Reference | Comment |
---|---|---|---|---|
92. | 468. | A | Stephenson and Malanowski, 1987 | Based on data from 453. to 533. K.; AC |
103. | 358. | A,ME | Stephenson and Malanowski, 1987 | Based on data from 343. to 387. K. See also Small, Small, et al., 1948.; AC |

Kovats' RI, non-polar column, isothermal

Column type | Active phase | Temperature (C) | I | Reference | Comment |
---|---|---|---|---|---|
Capillary | OV-101 | 230. | 2305. | Friocourt, Berthou, et al., 1979 | 50. m/0.3 mm/0.35 μm, N2 |
Capillary | OV-101 | 230. | 2306. | Friocourt, Berthou, et al., 1979 | 50. m/0.3 mm/0.35 μm, H2 |
Capillary | SE-30 | 250. | 2308. | Friocourt, Berthou, et al., 1979 | 42. m/0.3 mm/0.39 μm, He |
Packed | SE-30 | 220. | 2272. | Zulaïca and Guiochon, 1963 | Column length: 2. m |

Normal alkane RI, non-polar column, temperature ramp

Column type | Active phase | I | Reference | Comment |
---|---|---|---|---|
Capillary | Ultra-1 | 2281. | Okumura, 1991 | 25. m/0.32 mm/0.25 μm, He, 3. K/min; Tstart: 80. C; Tend: 260. C |
Capillary | OV-101 | 2331. | Zenkevich and Ventura, 1991 | Helium, 50. C @ 0. min, 5. K/min, 240. C @ 0. min; Column length: 54. m; Column diameter: 0.26 mm |

Normal alkane RI, non-polar column, custom temperature program

Column type | Active phase | I | Reference | Comment |
---|---|---|---|---|
Capillary | Squalane | 2308. | Chen, 2008 | Program: not specified |
Capillary | OV-1, SE-30, Methyl silicone, SP-2100, OV-101, DB-1, etc. | 2306. | Waggott and Davies, 1984 | Hydrogen; Column length: 50. m; Column diameter: 0.32 mm; Program: not specified |

References

Frinton Laboratories Inc., 1986
Frinton Laboratories Inc.,
Catalog Number 11, Frinton Laboratories Inc., Vineland, NJ, 1986, 99. [all data]
Stephenson and Malanowski, 1987
Stephenson, Richard M.; Malanowski, Stanislaw,
Handbook of the Thermodynamics of Organic Compounds, 1987, https://doi.org/10.1007/978-94-009-3173-2
. [all data]
Small, Small, et al., 1948
Small, P.A.; Small, K.W.; Cowley, P.,
The vapour pressures of some high boiling esters.,
Trans. Faraday Soc., 1948, 44, 810. [all data]
Friocourt, Berthou, et al., 1979
Friocourt, M.P.; Berthou, F.; Picart, D.; Dreano, Y.; Floch, H.H.,
Glass Capillary Column Gas Chromatography of Phthalate Esters,
J. Chromatogr., 1979, 172, 1, 261-271, https://doi.org/10.1016/S0021-9673(00)90961-0
. [all data]
Zulaïca and Guiochon, 1963
Zulaïca, J.; Guiochon, G.,
Séparation et identification de di-esters aliphatiques et aromatiques et de trimesters phosphoriques par chromatographie en phase gazeuse,
Bull. Soc. Chim. Fr., 1963, 6, 1242-1252. [all data]
Okumura, 1991
Okumura, T.,
retention indices of environmental chemicals on methyl silicone capillary column,
Journal of Environmental Chemistry (Japan), 1991, 1, 2, 333-358, https://doi.org/10.5985/jec.1.333
. [all data]
Zenkevich and Ventura, 1991
Zenkevich, I.G.; Ventura, K.,
Gas Chromatographic Identification of Volatile Products of Thermal Degradation of Bitumen,
Zh. Prikl. Khim. (Rus.), 1991, 9, 1974-1979. [all data]
Chen, 2008
Chen, H.-F.,
Quantitative prediction of gas chromatography retention indices with support vector machines, radial basis neutral networks and multiple linear regression,
Anal. Chim. Acta, 2008, 609, 1, 24-36, https://doi.org/10.1016/j.aca.2008.01.003
. [all data]
Waggott and Davies, 1984
Waggott, A.; Davies, I.W.,
Identification of organic pollutants using linear temperature programmed retention indices (LTPRIs) - Part II, 1984, retrieved from http://dwi.defra.gov.uk/research/completed-research/reports/dwi0383.pdf. [all data]