Lorazepam
- Formula: C15H11Cl2N2O2
- Molecular weight: 322.166
- IUPAC Standard InChIKey: DIWRORZWFLOCLC-UHFFFAOYSA-N
- CAS Registry Number: 846-49-1
- Chemical structure:
View 3d structure (requires JavaScript / HTML 5) - Other names: 2H-1,4-Benzodiazepin-2-one, 7-chloro-5-(2-chlorophenyl)-1,3-dihydro-3-hydroxy-; 2H-1,4-Benzodiazepin-2-one, 7-chloro-5-(o-chlorophenyl)-1,3-dihydro-3-hydroxy-; o-Chlorooxazepam; o-Chloroxazepam; Tavor; Temesta; Wy 4036; Ativan; 7-Chloro-5-(o-chlorophenyl)-1,3-dihydro-3-hydroxy-2H-1,4-benzodiazepin-2-one; Almazine; 7-Chloro-5-(2-chlorophenyl)-1,3-dihydro-3-hydroxy-2H-1,4-benzodiazepin-2-one; 7-Chloro-5-(2-chlorophenyl)-3-hydroxy-1H-1,4-benzodiazepin-2(3H)-one; Emotival; Lorax; Lorsilan; Psicopax; Wypax; (.+/-.)-Lorazepam; Pro dorm; Punktyl; Quait; Securit; Sedatival; Sedazin; Somagerol; Anxiedin; Anxira; Anzepam; Aplacasse; Apo-Lorazepam; Aripax; Azurogen; Bonatranquan; Bonton; Delormetazepam; Demethyllormetazepam; Duralozam; Efasedan; Equitam; Kalmalin; Larpose; Laubeel; Lorabenz; Loram; Lorapam; Lorat; Lorazene; Lorazep; Lorazin; Lorenin; Loridem; Lorsedal; Lozepam; Merlit; Nervistop L; Norlormetazepam; Novhepar; NSC 289758; Orfidal; Renaquil; Rocosgen; Sedizepan; Sidenar; Silence; Stapam; Titus; Tranqipam; Trapax; Upan; 7-Chloro-5-(2-chlorophenyl)-3-hydroxy-1,3-dihydro-2H-1,4-benzodiazepin-2-one; 7-Chloro-5-(2-chlorophenyl)-1,3-dihydro-3-hydroxy-2H-1,4-benzodiazepin-2-one ((±)lorazepam)

Phase change data

Data compiled by: William E. Acree, Jr., James S. Chickos
Enthalpy of fusion
ΔfusH (kcal/mol) | Temperature (K) | Method | Reference |
---|---|---|---|
18.0 | 453.2 | DSC | Wassvik, Holmén, et al., 2008 |
22.12 | 446.5 | DSC | Verheyen, Augustijns, et al., 2001 |

Kovats' RI, non-polar column, isothermal

Column type | Active phase | Temperature (C) | I | Reference | Comment |
---|---|---|---|---|---|
Capillary | SE-30 | 250. | 2423. | Dimov and Moskovkina, 1991 | |
Capillary | BP-1 | 250. | 2448. | Japp, Garthwaite, et al., 1988 | 25. m/0.22 mm/0.25 μm, N2 |
Capillary | DB-1 | 250. | 2423. | Japp, Garthwaite, et al., 1988 | 30. m/0.53 mm/1.5 μm, N2 |
Packed | SE-30 | 240. | 2384. | Musumarra, Scarlata, et al., 1987 | N2, 1% se-30 on Anachrom ABS(80-100mesh); Column length: 2. m |
Capillary | SPB-1 | 250. | 2430. | Lora-Tamayo, Rams, et al., 1986 | He; Column length: 25. m; Column diameter: 0.20 mm |
Packed | SE-30 | 250. | 2442. | Schütz, 1982 | N2 |
Packed | SE-30 | 250. | 2440. | Schuetz and Westenberger, 1979 | N2, Chromosorb G AW DMCS (80-100 mesh); Column length: 1.5 m |

Kovats' RI, non-polar column, temperature ramp

Column type | Active phase | I | Reference | Comment |
---|---|---|---|---|
Capillary | SE-30 | 2411. | Schepers, Wijsbeek, et al., 1982 | 12. m/0.22 mm/0.45 μm, He, 120. C @ 2. min, 8. K/min, 300. C @ 12. min |
Capillary | SE-30 | 2399. | Schepers, Wijsbeek, et al., 1982 | 25. m/0.49 mm/1.14 μm, 100. C @ 2. min, 8. K/min, 275. C @ 15. min |

Kovats' RI, non-polar column, custom temperature program

Column type | Active phase | I | Reference | Comment |
---|---|---|---|---|
Packed | OV-101 | 2430. | McLinden and Stenhouse, 1979 | N2, Chromosorb W; Column length: 2. m; Program: not specified |

Van Den Dool and Kratz RI, non-polar column, temperature ramp

Column type | Active phase | I | Reference | Comment |
---|---|---|---|---|
Capillary | VF-5MS | 2492.8 | Tretyakov, 2014 | 30. m/0.25 mm/0.25 μm, He; Tstart: 60. C; Tend: 270. C |
Capillary | SPB-1 | 2426. | Christ, Noomano, et al., 1988 | 30. m/0.75 mm/1.0 μm, He, 10. K/min, 280. C @ 12. min; Tstart: 160. C |
Capillary | DB-1 | 2375. | Perrigo, Peel, et al., 1985 | 15. m/0.32 mm/0.25 μm, He, 8. K/min, 280. C @ 5. min; Tstart: 120. C |
Capillary | DB-1 | 2375. | Perrigo, Ballantyne, et al., 1984 | 15. m/0.25 mm/0.25 μm, He, 8. K/min, 280. C @ 5. min; Tstart: 120. C |
Packed | SE-30 | 2380. | Perrigo and Peel, 1981 | N2, Chromosorb W, 130. C @ 2. min, 8. K/min, 290. C @ 8. min; Column length: 1.8 m |

Normal alkane RI, non-polar column, temperature ramp

Column type | Active phase | I | Reference | Comment |
---|---|---|---|---|
Packed | SE-30 | 2402. | MHA, 9999 | Nitrogen, Chromosorb G AW DMCS (80-100 mesh); Column length: 2. m; Tstart: 100. C; Tend: 300. C |
Packed | SE-30 | 2402. | MHA, 9999 | Nitrogen, Chromosorb G AW DMCS (80-100 mesh); Column length: 2. m; Tstart: 100. C; Tend: 300. C |
Capillary | BP-1 | 2448. | MHA, 9999 | Tstart: 100. C; Tend: 300. C |
Capillary | DB-5 | 2448. | Zamechnik, Ethier, et al., 1989 | 15. m/0.25 mm/0.25 μm, He, 150. C @ 1. min, 10. K/min; Tend: 260. C |
Packed | SE-30 | 2430. | Chiarotti, de Giovanni, et al., 1986 | He, Chromosorb W(100-120 mesh), 200. C @ 2. min, 4. K/min, 285. C @ 10. min; Column length: 2. m |
Packed | SE-30 | 2395. | Marozzi, Gambaro, et al., 1982 | Gas Chrom P, 5. K/min; Column length: 2. m; Tstart: 150. C; Tend: 300. C |

Normal alkane RI, non-polar column, custom temperature program

Column type | Active phase | I | Reference | Comment |
---|---|---|---|---|
Capillary | SPB-1 | 2391. | Chiarotti, de Giovanni, et al., 1986 | He, Chromosorb W(100-120 mesh); Column length: 25. m; Phase thickness: 0.4 μm |
Other | Methyl Silicone | 2402. | Ardrey and Moffat, 1981 | Program: not specified |

References

Wassvik, Holmén, et al., 2008
Wassvik, Carola M.; Holmén, Anders G.; Draheim, Rieke; Artursson, Per; Bergström, Christel A.S.,
Molecular Characteristics for Solid-State Limited Solubility,
J. Med. Chem., 2008, 51, 10, 3035-3039, https://doi.org/10.1021/jm701587d
. [all data]
Verheyen, Augustijns, et al., 2001
Verheyen, S.; Augustijns, P.; Kinget, R.; Van den Mooter, G.,
Determination of partial solubility parameters of five benzodiazepines in individual solvents,
International Journal of Pharmaceutics, 2001, 228, 1-2, 199-207, https://doi.org/10.1016/S0378-5173(01)00838-9
. [all data]
Dimov and Moskovkina, 1991
Dimov, N.; Moskovkina, M.,
New aspects of quantitative structure-retention relationships in chromatography,
J. Chromatogr., 1991, 552, 59-69, https://doi.org/10.1016/S0021-9673(01)95923-0
. [all data]
Japp, Garthwaite, et al., 1988
Japp, M.; Garthwaite, K.; Geeson, A.V.; Osselton, M.D.,
Collection of Analytical Data for Benzodiazepines and Benzophenones,
J. Chromatogr., 1988, 439, 2, 317-339, https://doi.org/10.1016/S0021-9673(01)83844-9
. [all data]
Musumarra, Scarlata, et al., 1987
Musumarra, G.; Scarlata, G.; Romano, G.; Cappello, G.; Clementi, S.; Giulietti, G.,
Qualitative organic analysis. Part 2. Identification of drugs by principal components analysis of standardized TLC data in four eluent systems and of retention indices on SE 30,
J. Anal. Toxicol., 1987, 11, 4, 154-163, https://doi.org/10.1093/jat/11.4.154
. [all data]
Lora-Tamayo, Rams, et al., 1986
Lora-Tamayo, C.; Rams, M.A.; Chacon, J.M.R.,
Gas Chromatographic Data for 187 Nitrogen- or Phosphorus-Containing Drugs and Metabolites of Toxicological Interest Analysed on Methyl Silicone Capillary Columns,
J. Chromatogr., 1986, 374, 73-85, https://doi.org/10.1016/S0378-4347(00)83254-5
. [all data]
Schütz, 1982
Schütz, H.,
Benzodiazepines, Springer-Verlag, New York, 1982, 438. [all data]
Schuetz and Westenberger, 1979
Schuetz, H.; Westenberger, V.,
Gas chromatographic data of 31 benzodiazepines and metabolites,
J. Chromatogr., 1979, 169, 409-411, https://doi.org/10.1016/0021-9673(75)85071-0
. [all data]
Schepers, Wijsbeek, et al., 1982
Schepers, P.; Wijsbeek, J.; Franke, J.P.; de Zeeuw, R.A.,
Applicability of capillary gas chromatography to substance identification in toxicology by means of retention indices,
J. Forensic Sci., 1982, 27, 1, 49-60. [all data]
McLinden and Stenhouse, 1979
McLinden, V.J.; Stenhouse, A.M.,
A chromatography system for drug identification,
Forensic Sci. Int., 1979, 13, 71-79, https://doi.org/10.1016/0379-0738(79)90265-2
. [all data]
Tretyakov, 2014
Tretyakov, K.V.,
Retention Data. NIST Mass Spectrometry Data Center., NIST Mass Spectrometry Data Center, 2014. [all data]
Christ, Noomano, et al., 1988
Christ, D.W.; Noomano, P.; Rosas, M.; Rhone, D.,
Retention indices by wide-bore capillary gas chromatography with nitrogen-phosphorus detection,
J. Anal. Toxicol., 1988, 12, 2, 84-88, https://doi.org/10.1093/jat/12.2.84
. [all data]
Perrigo, Peel, et al., 1985
Perrigo, B.J.; Peel, H.W.; Ballantyne, D.J.,
Use of Dual-Column Fused-Silica Capillary Gas Chromatography in Combination with Detector Response Factors for Analytical Toxicology.,
J. Chromatogr., 1985, 341, 81-88, https://doi.org/10.1016/S0378-4347(00)84011-6
. [all data]
Perrigo, Ballantyne, et al., 1984
Perrigo, B.J.; Ballantyne, D.J.; Peel, H.W.,
Condierations in developing a data base for drugs on a DBI capillary column,
J. Can. Soc. Forensic Sci., 1984, 17, 2, 41-49, https://doi.org/10.1080/00085030.1984.10757360
. [all data]
Perrigo and Peel, 1981
Perrigo, B.J.; Peel, H.W.,
The use of retention indices and temperature-programmed gas chromatography in analytical toxicology,
J. Chromatogr. Sci., 1981, 19, 5, 219-226, https://doi.org/10.1093/chromsci/19.5.219
. [all data]
MHA, 9999
MHA, Directorate of ForensicScience.,
Forensic Toxicology, 9999. [all data]
Zamechnik, Ethier, et al., 1989
Zamechnik, J.; Ethier, J.-C.; Neville, G.A.,
Benzodiazepines- an extensive collection of mass spectra,
J. Can. Soc. Forensic Sci., 1989, 22, 3, 233-259, https://doi.org/10.1080/00085030.1989.10757437
. [all data]
Chiarotti, de Giovanni, et al., 1986
Chiarotti, M.; de Giovanni, N.; Fiori, A.,
Analysis of Benzodiazepines. I. Chromatographic Identification,
J. Chromatogr., 1986, 358, 169-178, https://doi.org/10.1016/S0021-9673(01)90326-7
. [all data]
Marozzi, Gambaro, et al., 1982
Marozzi, E.; Gambaro, V.; Saligari, E.; Mariani, R.; Lodi, F.,
Use of the retention index in gas chromatographic studies of drugs,
J. Anal. Toxicol., 1982, 6, 4, 185-192, https://doi.org/10.1093/jat/6.4.185
. [all data]
Ardrey and Moffat, 1981
Ardrey, R.E.; Moffat, A.C.,
Gas-liquid chromatographic retention indices of 1318 substances of toxicological interest on SE-30 or OV-1 stationary phase,
J. Chromatogr., 1981, 220, 3, 195-252, https://doi.org/10.1016/S0021-9673(00)81925-1
. [all data]