Androstane-3,17-dione, (5α)-
- Formula: C19H28O2
- Molecular weight: 288.4244
- IUPAC Standard InChIKey: RAJWOBJTTGJROA-BQWQYDDZSA-N
- CAS Registry Number: 846-46-8
- Chemical structure:
- Other names: 5α-Androstane-3,17-dione; Androstane-3,17-dione; 5α-Androsta-3,17-dione; 5α-Androstanedione; 5α-Androstan-3,17-dione

Condensed phase thermochemistry data

Data compiled by: Hussein Y. Afeefy, Joel F. Liebman, and Stephen E. Stein
Quantity | Value | Units | Method | Reference | Comment |
---|---|---|---|---|---|
ΔcH°solid | -10930. ± 46. | kJ/mol | Ccb | Paoli, Garrigues, et al., 1969 | Corresponding ΔfHºsolid = -544. kJ/mol (simple calculation by NIST; no Washburn corrections) |

Phase change data

Data compiled by: Thermodynamics Research Center, NIST Boulder Laboratories, Chris Muzny director
Quantity | Value | Units | Method | Reference | Comment |
---|---|---|---|---|---|
Tfus | 403. | K | N/A | Allinger and DaRooge, 1962 | Uncertainty assigned by TRC = 3. K |

Van Den Dool and Kratz RI, non-polar column, custom temperature program

Column type | Active phase | I | Reference | Comment |
---|---|---|---|---|
Capillary | VF-5MS | 2651.2 | Tret'yakov, 2008 | 30. m/0.25 mm/0.25 μm, He; Program: Multi-step temperature program; T(initial)=60C; T(final)=270C |

References

Paoli, Garrigues, et al., 1969
Paoli, D.; Garrigues, J.-C.; Patin, H.,
Combustion microcalorimetry: application to steroids,
C. R. Acad. Sci. Paris, 1969, 268, 780-783. [all data]
Allinger and DaRooge, 1962
Allinger, N.L.; DaRooge, M.A.,
Conformational analysis: XXXII The conformation of ring a in 2,2- and 4,4- dimethyl-3-ketosteroids,
J. Am. Chem. Soc., 1962, 84, 4561. [all data]
Tret'yakov, 2008
Tret'yakov, K.V.,
Retention Data. NIST Mass Spectrometry Data Center., NIST Mass Spectrometry Data Center, 2008. [all data]