Dicyclohexyl phthalate
- Formula: C20H26O4
- Molecular weight: 330.4180
- IUPAC Standard InChIKey: VOWAEIGWURALJQ-UHFFFAOYSA-N
- CAS Registry Number: 84-61-7
- Chemical structure:

Condensed phase thermochemistry data

Data compiled by: Hussein Y. Afeefy, Joel F. Liebman, and Stephen E. Stein
Quantity | Value | Units | Method | Reference | Comment |
---|---|---|---|---|---|
ΔfH°solid | -222.6 ± 2.6 | kcal/mol | Ccb | Tavernier and Lamouroux, 1957 | Reanalyzed by Cox and Pilcher, 1970, Original value = -217.92 kcal/mol; Author's hf298_condensed=-227.798 kcal/mol |
Quantity | Value | Units | Method | Reference | Comment |
ΔcH°solid | -2546.5 ± 2.6 | kcal/mol | Ccb | Tavernier and Lamouroux, 1957 | Reanalyzed by Cox and Pilcher, 1970, Original value = -2551.21 kcal/mol; Author's hf298_condensed=-227.798 kcal/mol; Corresponding ΔfHºsolid = -222.62 kcal/mol (simple calculation by NIST; no Washburn corrections) |

Phase change data

Data compiled by: William E. Acree, Jr., James S. Chickos
Enthalpy of vaporization
ΔvapH (kcal/mol) | Temperature (K) | Method | Reference | Comment |
---|---|---|---|---|
23. | 406. | A | Stephenson and Malanowski, 1987 | Based on data from 391. to 475. K. |

Kovats' RI, non-polar column, isothermal

View large format table.

Column type Active phase Temperature (C) I Reference Comment
CapillarySE-30250.2475.Friocourt, Berthou, et al., 197950. m/0.3 mm/0.39 μm, He

Kovats' RI, non-polar column, custom temperature program

View large format table.

Column type Active phase I Reference Comment
PackedSE-302461.Ramsey, Lee, et al., 1980He, Chromosorb G HP (80-100 mesh); Column length: 1.5 m; Program: not specified

Van Den Dool and Kratz RI, non-polar column, temperature ramp

View large format table.

Column type Active phase I Reference Comment
PackedSE-302472.Messadi and Vergnaud, 1979N2, Chromosorb Q, 10. K/min; Tstart: 100. C; Tend: 340. C

Normal alkane RI, non-polar column, temperature ramp

View large format table.

Column type Active phase I Reference Comment
PackedSE-302523.Lourici, Souici, et al., 1999Nitrogen, Chromosorb Q (60-80 mesh), 8. K/min; Column length: 2. m; Tstart: 100. C; Tend: 290. C
PackedSE-302524.Lourici, Souici, et al., 1999Nitrogen, Chromosorb Q (60-80 mesh), 8. K/min; Column length: 2. m; Tstart: 100. C; Tend: 290. C
PackedSE-302524.Lourici, Souici, et al., 1999Nitrogen, Chromosorb Q (60-80 mesh), 8. K/min; Column length: 2. m; Tstart: 100. C; Tend: 290. C
PackedSE-302526.Lourici, Souici, et al., 1999Nitrogen, Chromosorb Q (60-80 mesh), 8. K/min; Column length: 2. m; Tstart: 100. C; Tend: 290. C
PackedSE-302526.Lourici, Souici, et al., 1999Nitrogen, Chromosorb Q (60-80 mesh), 8. K/min; Column length: 2. m; Tstart: 100. C; Tend: 290. C
PackedSE-302527.Lourici, Souici, et al., 1999Nitrogen, Chromosorb Q (60-80 mesh), 8. K/min; Column length: 2. m; Tstart: 100. C; Tend: 290. C
PackedSE-302533.Lourici, Souici, et al., 1999Nitrogen, Chromosorb Q (60-80 mesh), 8. K/min; Column length: 2. m; Tstart: 100. C; Tend: 290. C

Normal alkane RI, non-polar column, custom temperature program

View large format table.

Column type Active phase I Reference Comment
OtherMethyl Silicone2461.Ardrey and Moffat, 1981Program: not specified
OtherMethyl Silicone2453.Ardrey and Moffat, 1981Program: not specified

References

Tavernier and Lamouroux, 1957
Tavernier, P.; Lamouroux, M.,
Determinations calorimetriques relatives a vingt et une substances organiques,
Mem. Poudres, 1957, 39, 335-356. [all data]
Cox and Pilcher, 1970
Cox, J.D.; Pilcher, G.,
Thermochemistry of Organic and Organometallic Compounds, Academic Press, New York, 1970, 1-636. [all data]
Stephenson and Malanowski, 1987
Stephenson, Richard M.; Malanowski, Stanislaw,
Handbook of the Thermodynamics of Organic Compounds, 1987, https://doi.org/10.1007/978-94-009-3173-2
. [all data]