2,4-Dimethyl-3-pentanol acetate
- Formula: C9H18O2
- Molecular weight: 158.2380
- IUPAC Standard InChIKey: OXCWHEWLKNJJET-UHFFFAOYSA-N
- CAS Registry Number: 84612-74-8
- Chemical structure:
View 3d structure (requires JavaScript / HTML 5) - Other names: Acetic acid, 2,4-dimethylpent-3-yl ester

Van Den Dool and Kratz RI, non-polar column, temperature ramp

Column type | Active phase | I | Reference | Comment |
---|---|---|---|---|
Capillary | 5 % Phenyl methyl siloxane | 1032. | Zaikin, 2010 | 30. m/0.25 mm/0.25 μm, 15. K/min, 270. C @ 15. min; Tstart: 60. C |

References

Zaikin, 2010
Zaikin, V.G.,
Personal communication: Retention indices measured during 2010, 2010. [all data]