9,10-Anthracenedione, 2-methyl-
- Formula: C15H10O2
- Molecular weight: 222.2387
- IUPAC Standard InChIKey: NJWGQARXZDRHCD-UHFFFAOYSA-N
- CAS Registry Number: 84-54-8
- Chemical structure:
View 3d structure (requires JavaScript / HTML 5) - Other names: Anthraquinone, 2-methyl-; β-Methylanthraquinone; Techtoquinone; Tectochinon; Tectoquinone; 2-Methylanthraquinone; 2-Methylanthra-9,10-quinone; NSC 607; 2-Methylanthracenedione

Phase change data

Data compiled by: Thermodynamics Research Center, NIST Boulder Laboratories, Chris Muzny director
Quantity | Value | Units | Method | Reference | Comment |
---|---|---|---|---|---|
Tfus | 449.17 | K | N/A | Witschonke, 1954 | Uncertainty assigned by TRC = 0.35 K |
Tfus | 449.45 | K | N/A | Witschonke, 1954 | Uncertainty assigned by TRC = 0.25 K |

Normal alkane RI, non-polar column, custom temperature program

Column type | Active phase | I | Reference | Comment |
---|---|---|---|---|
Capillary | Methyl Silicone | 2035. | Oda, Yasuhara, et al., 1998 | 25. m/0.25 mm/0.25 μm, He; Program: 50 0C (2 min) 20 0C/min -> 160 0C 5 0C/min -> 210 0C 10 0C/min -> 300 0C |
Capillary | Methyl Silicone | 2055. | Oda, Yasuhara, et al., 1998 | 25. m/0.25 mm/0.25 μm, He; Program: 50 0C (2 min) 20 0C/min -> 160 0C 5 0C/min -> 210 0C 10 0C/min -> 300 0C |

Lee's RI, non-polar column, custom temperature program

Column type | Active phase | I | Reference | Comment |
---|---|---|---|---|
Capillary | DB-5 | 350.1 | Lundstedt, Haglund, et al., 2003 | 30. m/0.25 mm/0.25 μm; Program: not specified |
Capillary | BP-5 | 352.7 | Kelly, Bartle, et al., 1992 | Column length: 25. m; Column diameter: 0.32 mm; Program: XX C X C/min -> 170 C 40 C/min -> 300 C (5 min); Check the values XX and X (bad xerox copy) |

References

Witschonke, 1954
Witschonke, C.R.,
Freezing point and purity data for some organic compounds,
Anal. Chem., 1954, 26, 562-4. [all data]
Oda, Yasuhara, et al., 1998
Oda, J.; Yasuhara, A.; Matsunaga, K.; Saito, Y.,
Identification of polycyclic aromatic hydrocarbons of the particulate accumulated in the tunnel duct of freeway and generation of their oxygenated derivatives,
Jpn. J. Toxicol. Environ. Health, 1998, 44, 5, 334-351, https://doi.org/10.1248/jhs1956.44.334
. [all data]
Lundstedt, Haglund, et al., 2003
Lundstedt, S.; Haglund, P.; Öberg, L.,
Degradation and formation of polycyclic aromatic compounds during bioslurry treatment of an aged gasworks soil,
Environ. Toxicol. Chem., 2003, 22, 7, 1413-1420, https://doi.org/10.1002/etc.5620220701
. [all data]
Kelly, Bartle, et al., 1992
Kelly, G.W.; Bartle, K.D.; Clifford, A.A.; Robinson, R.E.,
Application of coupled LC-GC to the analysis of the polar fraction of diesel particulate matter,
J. Hi. Res. Chromatogr., 1992, 15, 8, 526-530, https://doi.org/10.1002/jhrc.1240150808
. [all data]