Z-Citronellyl tiglate
- Formula: C15H26O2
- Molecular weight: 238.3657
- IUPAC Standard InChIKey: UCFQYMKLDPWFHZ-VYAXBHEWSA-N
- CAS Registry Number: 84254-89-7
- Chemical structure:
View 3d structure (requires JavaScript / HTML 5) - Stereoisomers:
- Other names: 3,7-dimethyl-6-octenyl 2-methylisocrotonate

Normal alkane RI, non-polar column, temperature ramp

Column type | Active phase | I | Reference | Comment |
---|---|---|---|---|
Capillary | CP Sil 5 CB | 1731. | Taiwo and Bolanle, 2003 | 25. m/0.25 mm/0.15 μm, 3. K/min; Tstart: 50. C; Tend: 230. C |

References

Taiwo and Bolanle, 2003
Taiwo, A.O.; Bolanle, A.A.,
The leaf essential oil of Costus afer Ker-Grawl from Nigeria,
Flavour Fragr. J., 2003, 18, 4, 309-311, https://doi.org/10.1002/ffj.1186
. [all data]