2-Naphthalenol, 1-(phenylazo)-

Condensed phase thermochemistry data

Data compiled by: Hussein Y. Afeefy, Joel F. Liebman, and Stephen E. Stein

Quantity Value Units Method Reference Comment
Δfsolid246.kJ/molCcbLemoult, 1908
Quantity Value Units Method Reference Comment
Δcsolid-8257.1kJ/molCcbLemoult, 1908

Phase change data

Data compiled by: William E. Acree, Jr., James S. Chickos

Enthalpy of sublimation

ΔsubH (kJ/mol) Temperature (K) Reference Comment
116.7 ± 5.4362.Krien, 1984Based on data from 350. - 374. K.

References

Lemoult, 1908
Lemoult, M.P., Recherches theoriques et experimentales sur les chaleurs de combustion et de formation des composes organiques, Ann. Chim. Phys., 1908, 14, 289-310. [all data]