2,6-Naphthalenedicarboxylic acid, dimethyl ester
- Formula: C14H12O4
- Molecular weight: 244.2427
- IUPAC Standard InChIKey: GYUVMLBYMPKZAZ-UHFFFAOYSA-N
- CAS Registry Number: 840-65-3
- Chemical structure:
View 3d structure (requires JavaScript / HTML 5) - Other names: Dimethyl 2,6-naphthalenedicarboxylate; Dimethyl naphthalene-2,6-dicarboxylate; 2,6-Dicarbomethoxynaphthalene; Naphthalene-2,6-dicarboxylic acid, dimethyl ester; Dimethyl ester of 2,6-naphthalenedicarboxylic acid

Gas phase thermochemistry data

Data compiled by: Hussein Y. Afeefy, Joel F. Liebman, and Stephen E. Stein
Quantity | Value | Units | Method | Reference | Comment |
---|---|---|---|---|---|
ΔfH°gas | -555.1 ± 6.1 | kJ/mol | Ccr | Steele, Chirico, et al., 1991 | ΔHfusion = 41.7±3.0 kJ/mol |

Condensed phase thermochemistry data

Data compiled as indicated in comments:
ALS - Hussein Y. Afeefy, Joel F. Liebman, and Stephen E. Stein
DH - Eugene S. Domalski and Elizabeth D. Hearing
Quantity | Value | Units | Method | Reference | Comment |
---|---|---|---|---|---|
ΔfH°solid | -696.5 ± 1.3 | kJ/mol | Ccr | Steele, Chirico, et al., 1991 | ΔHfusion = 41.7±3.0 kJ/mol; ALS |
Quantity | Value | Units | Method | Reference | Comment |
ΔcH°solid | -6527.6 ± 1.2 | kJ/mol | Ccr | Steele, Chirico, et al., 1991 | ΔHfusion = 41.7±3.0 kJ/mol; Corresponding ΔfHºsolid = -696.51 kJ/mol (simple calculation by NIST; no Washburn corrections); ALS |
Constant pressure heat capacity of solid
Cp,solid (J/mol*K) | Temperature (K) | Reference | Comment |
---|---|---|---|
283.8 | 298.15 | N/A | T = 310 to 670 K. C/R(c) = 0.0960T + 5.51 (310 to 464.5 K); C/R(liq) = 0.0635T + 26.29 (464.5 to 670 K), R = 8.31451 J/mol*K.; DH |

Phase change data

Data compiled as indicated in comments:
TRC - Thermodynamics Research Center, NIST Boulder Laboratories, Chris Muzny director
DRB - Donald R. Burgess, Jr.
DH - Eugene S. Domalski and Elizabeth D. Hearing
Quantity | Value | Units | Method | Reference | Comment |
---|---|---|---|---|---|
Tfus | 464.5 | K | N/A | Steele, Chirico, et al., 1991, 2 | Uncertainty assigned by TRC = 0.7 K; TRC |
Tfus | 464.4 | K | N/A | Dozen, Fujishima, et al., 1978 | Uncertainty assigned by TRC = 0.1 K; TRC |
Quantity | Value | Units | Method | Reference | Comment |
ΔsubH° | 141.4 | kJ/mol | N/A | Steele, Chirico, et al., 1991 | DRB |
Enthalpy of fusion
ΔfusH (kJ/mol) | Temperature (K) | Reference | Comment |
---|---|---|---|
53.300 | 464.5 | N/A | DH |

Normal alkane RI, non-polar column, temperature ramp

Column type | Active phase | I | Reference | Comment |
---|---|---|---|---|
Capillary | Ultra-ALLOY-5 | 2118. | Tsuge, Ohtan, et al., 2011 | 30. m/0.25 mm/0.25 μm, 40. C @ 2. min, 20. K/min, 320. C @ 13. min |

References

Steele, Chirico, et al., 1991
Steele, W.V.; Chirico, R.D.; Nguyen, A.; Hossenlopp, I.A.; Smith, N.K.,
DIPPR PROJECT 871: Determination of ideal-gas enthalpies of formation for key compounds: The 1989 project results,
J. Chem. Thermodyn., 1991, 101-134. [all data]
Steele, Chirico, et al., 1991, 2
Steele, W.V.; Chirico, R.D.; Nguyen, A.; Hossenlopp, I.A.; Smith, N.K.,
DIPPR Project 871: determination of ideal-gas enthalpies of formation for key compounds: the 1989 project results
in DIPPR Data Ser. 1, 1991. [all data]
Dozen, Fujishima, et al., 1978
Dozen, Y.; Fujishima, S.; Shingu, H.,
Structures and fusion parameters of methoxycarbonyl-benzenes and -naphthalenes,
Thermochim. Acta, 1978, 25, 2, 209, https://doi.org/10.1016/0040-6031(78)85008-4
. [all data]
Tsuge, Ohtan, et al., 2011
Tsuge, S.; Ohtan, H.; Watanabe, C.,
Pyrolysis - GC/MS Data Book of Synthetic Polymers, Elsevier, 2011, 420. [all data]