butane-1,2,3-triyl trinitrate
- Formula: C4H7N3O9
- Molecular weight: 241.1131
- IUPAC Standard InChIKey: GIFRMMSPDQZIHL-UHFFFAOYSA-N
- CAS Registry Number: 84002-64-2
- Chemical structure:
View 3d structure (requires JavaScript / HTML 5) - Other names: 1,2,3-Butanetriol, trinitrate

Condensed phase thermochemistry data

Data compiled by: Hussein Y. Afeefy, Joel F. Liebman, and Stephen E. Stein
Quantity | Value | Units | Method | Reference | Comment |
---|---|---|---|---|---|
ΔcH°liquid | -2175.7 | kJ/mol | Ccb | Castronia, 1949 |

References

Castronia, 1949
Castronia, T.C.,
Long range basic research leading to the development of ideal propellants,
Picatinny Arsenal Techn. Rep. No. 1755, 1949, 1. [all data]