Ibogaine
- Formula: C20H26N2O
- Molecular weight: 310.4332
- IUPAC Standard InChIKey: HSIBGVUMFOSJPD-UHFFFAOYSA-N
- CAS Registry Number: 83-74-9
- Chemical structure:

Kovats' RI, non-polar column, isothermal

Column type | Active phase | Temperature (C) | I | Reference | Comment |
---|---|---|---|---|---|
Capillary | BP-1 | 275. | 2895. | Japp, Gill, et al., 1987 | 25. m/0.22 mm/0.25 μm, N2 |
Capillary | DB-1 | 275. | 2915. | Japp, Gill, et al., 1987 | 30. m/0.53 mm/1.5 μm, N2 |
Capillary | BP-1 | 275. | 2908. | Japp, Gill, et al., 1987 | 25. m/0.53 mm/1. μm, N2 |

Van Den Dool and Kratz RI, non-polar column, temperature ramp

Column type | Active phase | I | Reference | Comment |
---|---|---|---|---|
Packed | SE-30 | 2900. | Perrigo and Peel, 1981 | N2, Chromosorb W, 130. C @ 2. min, 8. K/min, 290. C @ 8. min; Column length: 1.8 m |

Normal alkane RI, non-polar column, custom temperature program

Column type | Active phase | I | Reference | Comment |
---|---|---|---|---|
Other | Methyl Silicone | 2872. | Ardrey and Moffat, 1981 | Program: not specified |

References

Japp, Gill, et al., 1987
Japp, M.; Gill, R.; Osselton, M.D.,
Comparison of drug retention indices determined on packed, wide bore capillary and narrow bore capillary columns,
J. Forensic Sci., 1987, 32, 6, 1574-1586. [all data]
Perrigo and Peel, 1981
Perrigo, B.J.; Peel, H.W.,
The use of retention indices and temperature-programmed gas chromatography in analytical toxicology,
J. Chromatogr. Sci., 1981, 19, 5, 219-226, https://doi.org/10.1093/chromsci/19.5.219
. [all data]
Ardrey and Moffat, 1981
Ardrey, R.E.; Moffat, A.C.,
Gas-liquid chromatographic retention indices of 1318 substances of toxicological interest on SE-30 or OV-1 stationary phase,
J. Chromatogr., 1981, 220, 3, 195-252, https://doi.org/10.1016/S0021-9673(00)81925-1
. [all data]