2-Butenoic acid, 2-hydroxy-, ethyl ester
- Formula: C6H10O3
- Molecular weight: 130.1418
- IUPAC Standard InChIKey: SLWKIJNJCXVBNR-HYXAFXHYSA-N
- CAS Registry Number: 83742-49-8
- Chemical structure:
View 3d structure (requires JavaScript / HTML 5) - Permanent link for this species. Use this link for bookmarking this species for future reference.

Reaction thermochemistry data

Data compiled by: Hussein Y. Afeefy, Joel F. Liebman, and Stephen E. Stein
Individual Reactions
By formula: C6H10O3 = C6H10O3
Quantity | Value | Units | Method | Reference | Comment |
---|---|---|---|---|---|
ΔrH° | -13.3 ± 1.0 | kJ/mol | Eqk | Folkendt, Weiss-Lopez, et al., 1985 | gas phase; NMR |

References

Folkendt, Weiss-Lopez, et al., 1985
Folkendt, M.M.; Weiss-Lopez, B.E.; Chauvel, J.P., Jr.; True, N.S.,
Gas-phase 1H NMR studies of keto-enol tautomerism of acetylacetone, methyl acetoacetate, and ethyl acetoacetate,
J. Phys. Chem., 1985, 89, 3347-3352. [all data]