Iodoquinol
- Formula: C9H5I2NO
- Molecular weight: 396.9510
- IUPAC Standard InChIKey: UXZFQZANDVDGMM-UHFFFAOYSA-N
- CAS Registry Number: 83-73-8
- Chemical structure:
View 3d structure (requires JavaScript / HTML 5) - Other names: 5,7-Diiodo-8-hydroxyquinoline; 8-Quinolinol, 5,7-diiodo-; Di-Quinol; Diamoebin; Diiodohydroxyquin; Diiodohydroxyquinoline; Diiodoquin; Dijodoxichinoline; Dinoleine; Diodohydroxyquin; Diodoquin; Diodoquine; Diodoxylin; Direxiode; Disoquin; Dyodin; Embequin; Enterodiamoebin; Enterosept; Floraquin; Fluoraquin; Ioquin suspension; Lanodoxin; Moebiquin; Quinadome; Searlequin; Sebaquin; SS 578; Yodoxin; Zoaquin; 5,7-Diiodo-oxine; 5,7-Diiodo-8-quinolinol; 5,7-Diodo-8-quinolinol; 8-Hydroxy-5,7-diiodoquinoline; Ioquin; Meobiquin; Rafamebin; Searlewuin; Stanquinate; NSC 8704

Gas phase thermochemistry data

Data compiled by: Hussein Y. Afeefy, Joel F. Liebman, and Stephen E. Stein
Quantity | Value | Units | Method | Reference | Comment |
---|---|---|---|---|---|
ΔfH°gas | 52.65 ± 0.45 | kcal/mol | Ccr | Ribeiro da Silva, Ferrao, et al., 1995 | Iodine soild |

Condensed phase thermochemistry data

Data compiled by: Hussein Y. Afeefy, Joel F. Liebman, and Stephen E. Stein
Quantity | Value | Units | Method | Reference | Comment |
---|---|---|---|---|---|
ΔfH°solid | 22.3 ± 0.41 | kcal/mol | Ccr | Ribeiro da Silva, Ferrao, et al., 1995 | Iodine soild |
Quantity | Value | Units | Method | Reference | Comment |
ΔcH°solid | -1039.6 ± 0.29 | kcal/mol | Ccr | Ribeiro da Silva, Ferrao, et al., 1995 | Iodine soild |

Phase change data

Data compiled as indicated in comments:
AC - William E. Acree, Jr., James S. Chickos
ALS - Hussein Y. Afeefy, Joel F. Liebman, and Stephen E. Stein
Quantity | Value | Units | Method | Reference | Comment |
---|---|---|---|---|---|
ΔsubH° | 30.3 ± 0.2 | kcal/mol | ME | Ribeiro da Silva and Monte, 1992 | Based on data from 389. to 404. K.; AC |
ΔsubH° | 26.5 ± 0.2 | kcal/mol | V | Horton and Wendlandt, 1963 | ALS |
Enthalpy of sublimation
ΔsubH (kcal/mol) | Temperature (K) | Method | Reference | Comment |
---|---|---|---|---|
29.1 ± 0.2 | 396. | ME | Ribeiro da Silva and Monte, 1992 | Based on data from 389. to 404. K.; AC |
26.51 | 403. to 423. | N/A | Horton and Wendlandt, 1963 | AC |

References

Ribeiro da Silva, Ferrao, et al., 1995
Ribeiro da Silva, M.A.V.; Ferrao, M.L.C.C.H.; Alves da Silva, M.R.O.,
Standard enthalpies of combustion of five halogen-substituted 8-hydroxyquinolines by rotating-bomb calorimetry,
J. Chem. Thermodyn., 1995, 27, 633-641. [all data]
Ribeiro da Silva and Monte, 1992
Ribeiro da Silva, M.A.V.; Monte, M.J.S.,
Vapour pressures and enthalpies of sublimation of six halogen-substituted 8-hydroxyquinolines,
J. Chem. Thermodyn., 1992, 24, 715-724. [all data]
Horton and Wendlandt, 1963
Horton, G.R.; Wendlandt, W.W.,
The heats of dissociation of the 8-quinolinol and substituted 8-quinolinol metal chelates of uranium (VI), thorium (IV) and scandium (III),
J. Inorg. Nucl. Chem., 1963, 25, 241-245. [all data]