Undecafluoropiperidine
- Formula: C5F11N
- Molecular weight: 283.0426
- IUPAC Standard InChIKey: VCEAGMYKGZNUFL-UHFFFAOYSA-N
- CAS Registry Number: 836-77-1
- Chemical structure:
View 3d structure (requires JavaScript / HTML 5) - Permanent link for this species. Use this link for bookmarking this species for future reference.

Gas phase thermochemistry data

Data compiled by: Hussein Y. Afeefy, Joel F. Liebman, and Stephen E. Stein
Quantity | Value | Units | Method | Reference | Comment |
---|---|---|---|---|---|
ΔfH°gas | -2003.7 ± 5.0 | kJ/mol | Ccb | Good, Todd, et al., 1963 | Reanalyzed by Cox and Pilcher, 1970, Original value = -1990.7 kJ/mol; Heat of combustion corrected for CF4 formation |
ΔfH°gas | -1995. | kJ/mol | Ccr | Good and Scott, 1959 | Private communication |

Condensed phase thermochemistry data

Data compiled as indicated in comments:
ALS - Hussein Y. Afeefy, Joel F. Liebman, and Stephen E. Stein
DH - Eugene S. Domalski and Elizabeth D. Hearing
Quantity | Value | Units | Method | Reference | Comment |
---|---|---|---|---|---|
ΔfH°liquid | -2071.3 ± 4.6 | kJ/mol | Ccb | Good, Todd, et al., 1963 | Reanalyzed by Cox and Pilcher, 1970, Original value = -2020.6 kJ/mol; Heat of combustion corrected for CF4 formation; ALS |
ΔfH°liquid | -2020. | kJ/mol | Ccr | Good and Scott, 1959 | Private communication; ALS |
Quantity | Value | Units | Method | Reference | Comment |
ΔcH°liquid | -1463. ± 3. | kJ/mol | Ccb | Good, Todd, et al., 1963 | Heat of combustion corrected for CF4 formation; ALS |
Quantity | Value | Units | Method | Reference | Comment |
S°liquid | 393.38 | J/mol*K | N/A | Good, Todd, et al., 1963 | DH |
Constant pressure heat capacity of liquid
Cp,liquid (J/mol*K) | Temperature (K) | Reference | Comment |
---|---|---|---|
296.77 | 298.15 | Good, Todd, et al., 1963 | T = 12 to 320 K.; DH |

Phase change data

Data compiled as indicated in comments:
TRC - Thermodynamics Research Center, NIST Boulder Laboratories, Chris Muzny director
ALS - Hussein Y. Afeefy, Joel F. Liebman, and Stephen E. Stein
AC - William E. Acree, Jr., James S. Chickos
DH - Eugene S. Domalski and Elizabeth D. Hearing
Quantity | Value | Units | Method | Reference | Comment |
---|---|---|---|---|---|
Ttriple | 274.12 | K | N/A | Good, Todd, et al., 1963, 2 | Crystal phase 1 phase; Uncertainty assigned by TRC = 0.02 K; TRC |
Quantity | Value | Units | Method | Reference | Comment |
ΔvapH° | 30.0 ± 0.2 | kJ/mol | E | Good, Todd, et al., 1963 | Heat of combustion corrected for CF4 formation; ALS |
Enthalpy of vaporization
ΔvapH (kJ/mol) | Temperature (K) | Method | Reference | Comment |
---|---|---|---|---|
30. | 317. | A | Stephenson and Malanowski, 1987 | Based on data from 302. to 355. K. See also Good, Todd, et al., 1963 and Dykyj, 1972.; AC |
Enthalpy of fusion
ΔfusH (kJ/mol) | Temperature (K) | Reference | Comment |
---|---|---|---|
2.82 | 274.1 | Domalski and Hearing, 1996 | AC |
Enthalpy of phase transition
ΔHtrs (kJ/mol) | Temperature (K) | Initial Phase | Final Phase | Reference | Comment |
---|---|---|---|---|---|
6.6275 | 161.0 | crystaline, III | crystaline, II | Good, Todd, et al., 1963 | DH |
1.8389 | 171.9 | crystaline, II | crystaline, I | Good, Todd, et al., 1963 | DH |
2.816 | 274.12 | crystaline, I | liquid | Good, Todd, et al., 1963 | DH |
Entropy of phase transition
ΔStrs (J/mol*K) | Temperature (K) | Initial Phase | Final Phase | Reference | Comment |
---|---|---|---|---|---|
41.16 | 161.0 | crystaline, III | crystaline, II | Good, Todd, et al., 1963 | DH |
10.70 | 171.9 | crystaline, II | crystaline, I | Good, Todd, et al., 1963 | DH |
10.27 | 274.12 | crystaline, I | liquid | Good, Todd, et al., 1963 | DH |

References

Good, Todd, et al., 1963
Good, W.D.; Todd, S.S.; Messerly, J.F.; Lacina, J.L.; Dawson, J.P.; Scott, D.W.; McCullough, J.P.,
Perfluoropiperidine: Entropy, heat of formation, and vapor pressure; N-F bond energy; and solid-state transitions,
J. Phys. Chem., 1963, 67, 1306-1311. [all data]
Cox and Pilcher, 1970
Cox, J.D.; Pilcher, G.,
Thermochemistry of Organic and Organometallic Compounds, Academic Press, New York, 1970, 1-636. [all data]
Good and Scott, 1959
Good, W.D.; Scott, D.W.,
Thermochemistry of organic fluorine compounds and carbon compounds of metals by rotating-bomb calorimetry,
Symposium uber Thermodynamik, Freitag, 1959, 1-7. [all data]
Good, Todd, et al., 1963, 2
Good, W.D.; Todd, S.S.; Messerly, J.F.; Lacina, J.L.; Dawson, J.P.; Scott, D.W.; McCullough, J.P.,
Perflouropiperidine: Entropy, heat of formation, and vapor pressure; N-F bond energy; and solid-state transitions.,
J. Phys. Chem., 1963, 67, 1306-11. [all data]
Stephenson and Malanowski, 1987
Stephenson, Richard M.; Malanowski, Stanislaw,
Handbook of the Thermodynamics of Organic Compounds, 1987, https://doi.org/10.1007/978-94-009-3173-2
. [all data]
Dykyj, 1972
Dykyj, J.,
Petrochemia, 1972, 12, 1, 13. [all data]
Domalski and Hearing, 1996
Domalski, Eugene S.; Hearing, Elizabeth D.,
Heat Capacities and Entropies of Organic Compounds in the Condensed Phase. Volume III,
J. Phys. Chem. Ref. Data, 1996, 25, 1, 1, https://doi.org/10.1063/1.555985
. [all data]