Musk ambrette (artificial)
- Formula: C12H16N2O5
- Molecular weight: 268.2658
- IUPAC Standard InChIKey: SUAUILGSCPYJCS-UHFFFAOYSA-N
- CAS Registry Number: 83-66-9
- Chemical structure:
View 3d structure (requires JavaScript / HTML 5) - Other names: Benzene, 1-(1,1-dimethylethyl)-2-methoxy-4-methyl-3,5-dinitro-; Anisole, 6-tert-butyl-3-methyl-2,4-dinitro-; Amber musk; Musk ambrette; Synthetic musk ambrette; 6-tert-Butyl-3-Methyl-2,4-dinitroanisol; 2-tert-Butyl-4,6-dinitro-5-methylanisole; 2,4-Dinitro-3-methyl-6-tert-butylanisole; 4-tert-Butyl-2,6-dinitro-3-methoxytoluene; 6-tert-Butyl-3-methyl-2,4-dinitroanisole; 2,6-Dinitro-3-methoxy-4-tert-butyltoluene; Anisole, 6-t-butyl-3-methyl-2,4-dinitro-; Artificial musk ambrette; 1-(1,1-Dimethylethyl)-2-methoxy-4-methyl-3,5-dinitrobenzene; 1-Methyl-4-t-butyl-3-methoxy-2,6-dinitrobenzene; 5-t-Butyl-1,3-dinitro-4-methoxy-2-methylbenzene; 6-t-Butyl-3-methyl-2,4-dinitroanisole; Musk amberette; 4-tert-Butyl-3-methoxy-2,6-dinitrotoluene; Ambrette musk; NSC 46122; 1-Methyl-4-tert-butyl-3-methoxy-2,6-dinitrobenzene

Phase change data

Data compiled by: William E. Acree, Jr., James S. Chickos
Enthalpy of sublimation
ΔsubH (kJ/mol) | Temperature (K) | Reference | Comment |
---|---|---|---|
102.9 | 293. to 353. | Serpinskii, Voitkevich, et al., 1953 | See also Jones, 1960. |

References

Serpinskii, Voitkevich, et al., 1953
Serpinskii, V.V.; Voitkevich, S.A.; Lyuboshits, N.Y.,
Zh. Fiz. Khim., 1953, 27, 1032. [all data]
Jones, 1960
Jones, A.H.,
Sublimation Pressure Data for Organic Compounds.,
J. Chem. Eng. Data, 1960, 5, 2, 196-200, https://doi.org/10.1021/je60006a019
. [all data]