Propyl naltrexone-3-O-carbonate

Phase change data

Data compiled by: William E. Acree, Jr., James S. Chickos

Enthalpy of fusion

ΔfusH (kJ/mol) Temperature (K) Method Reference
20.97379.2DSCPillai, Hamad, et al., 2004

References

Pillai, Hamad, et al., 2004
Pillai, Omathanu; Hamad, Mohamed O.; Crooks, Peter A.; Stinchcomb, Audra L., Physicochemical Evaluation, in Vitro Human Skin Diffusion, and Concurrent Biotransformation of 3-O-Alkyl Carbonate Prodrugs of Naltrexone, Pharm Res, 2004, 21, 7, 1146-1152, https://doi.org/10.1023/B:PHAM.0000033000.03652.73 . [all data]