6-methyl-2,4-heptadiene
- Formula: C8H14
- Molecular weight: 110.1968
- IUPAC Standard InChIKey: MWTPBEVCVOHWSX-YTXTXJHMSA-N
- CAS Registry Number: 83608-76-8
- Chemical structure:
View 3d structure (requires JavaScript / HTML 5) - Permanent link for this species. Use this link for bookmarking this species for future reference.

Phase change data

Data compiled by: Thermodynamics Research Center, NIST Boulder Laboratories, Chris Muzny director
Quantity | Value | Units | Method | Reference | Comment |
---|---|---|---|---|---|
Tboil | 396.9 | K | N/A | Karasev and Khabarova, 1940 | Uncertainty assigned by TRC = 2. K |
Tboil | 388. | K | N/A | Reif, 1908 | Uncertainty assigned by TRC = 4. K |

References

Karasev and Khabarova, 1940
Karasev, K.I.; Khabarova,
Zh. Obshch. Khim., 1940, 10, 1641. [all data]
Reif, 1908
Reif, J.,
The effect of magnesium organic compounds on orotonaldehyde (2-butene), and the optic behavior of the products,
Ber. Dtsch. Chem. Ges., 1908, 41, 2739-46. [all data]