β-Sitosterol

Phase change data

Data compiled as indicated in comments:
AC - William E. Acree, Jr., James S. Chickos
DH - Eugene S. Domalski and Elizabeth D. Hearing

Enthalpy of sublimation

ΔsubH (kJ/mol) Temperature (K) Method Reference Comment
143.8 ± 0.5389. - 410.MEOja, Chen, et al., 2009AC

Enthalpy of phase transition

ΔHtrs (kJ/mol) Temperature (K) Initial Phase Final Phase Reference Comment
2.900342.7crystaline, IIcrystaline, IPetropavlov, Tsygankova, et al., 1988DH

Entropy of phase transition

ΔStrs (J/mol*K) Temperature (K) Initial Phase Final Phase Reference Comment
8.4342.7crystaline, IIcrystaline, IPetropavlov, Tsygankova, et al., 1988DH

Kovats' RI, non-polar column, isothermal

View large format table.

Column type Active phase Temperature (C) I Reference Comment
PackedSE-30230.3201.Keiser, Retunskii, et al., 1990N2; Column length: 1.2 m
PackedSE-30240.3215.Keiser, Retunskii, et al., 1990N2; Column length: 1.2 m
PackedE-301210.3197.Keiser, Retunskii, et al., 1990N2; Column length: 1.2 m
PackedE-301220.3173.Keiser, Retunskii, et al., 1990N2; Column length: 1.2 m
PackedE-301220.3228.Keiser, Retunskii, et al., 1990N2; Column length: 1.2 m
PackedE-301230.3194.Keiser, Retunskii, et al., 1990N2; Column length: 1.2 m
PackedE-301230.3243.Keiser, Retunskii, et al., 1990N2; Column length: 1.2 m
PackedE-301240.3214.Keiser, Retunskii, et al., 1990N2; Column length: 1.2 m
PackedSE-30230.3201.Keiser, Yazlovetsky, et al., 1986N2; Column length: 1.2 m
PackedSE-30240.3215.Keiser, Yazlovetsky, et al., 1986N2; Column length: 1.2 m
PackedSE-30250.3230.Keiser, Yazlovetsky, et al., 1986N2; Column length: 1.2 m
PackedSE-30240.3198.Keiser, Yazlovetsky, et al., 1986N2; Column length: 1.2 m
PackedSE-30240.3199.Keiser, Yazlovetsky, et al., 1986N2; Column length: 1.2 m
PackedSE-30240.3202.Keiser, Yazlovetsky, et al., 1986N2; Column length: 1.2 m
PackedSE-30240.3203.Keiser, Yazlovetsky, et al., 1986N2; Column length: 1.2 m
PackedSE-30240.3204.Keiser, Yazlovetsky, et al., 1986N2; Column length: 1.2 m

Normal alkane RI, non-polar column, temperature ramp

View large format table.

Column type Active phase I Reference Comment
CapillaryHP-5 MS3203.Xu, Han, et al., 201230. m/0.25 mm/0.25 μm, 60. C @ 2. min, 15. K/min, 300. C @ 10. min
CapillaryDB-5 MS3197.Stojanovic, RAdulovic, et al., 201130. m/0.25 mm/0.25 μm, Helium, 5. K/min, 290. C @ 10. min; Tstart: 70. C
CapillaryHP-5 MS3187.Radulovic, Blagojevic, et al., 200930. m/0.25 mm/0.25 μm, Helium, 5. K/min, 290. C @ 10. min; Tstart: 70. C
CapillaryHP-5 MS3203.Xu, Han, et al., 200930. m/0.25 mm/0.25 μm, Helium, 60. C @ 2. min, 15. K/min, 300. C @ 10. min

Normal alkane RI, non-polar column, custom temperature program

View large format table.

Column type Active phase I Reference Comment
Capillary 3220.El-Shazily, Hafez, et al., 2004Program: not specified
CapillaryOV-13220.El-Shazly and Hussein, 2004He; Column length: 15. m; Column diameter: 0.317 mm; Program: 50C(4min) => 4C/min => 90C => 10C/min => 300C(10min)
CapillaryOV-1, SE-30, Methyl silicone, SP-2100, OV-101, DB-1, etc.3193.Waggott and Davies, 1984Hydrogen; Column length: 50. m; Column diameter: 0.32 mm; Program: not specified
OtherMethyl Silicone3193.Ardrey and Moffat, 1981Program: not specified

References

Oja, Chen, et al., 2009
Oja, Vahur; Chen, Xu; Hajaligol, Mohammad R.; Chan, W. Geoffrey, Sublimation Thermodynamic Parameters for Cholesterol, Ergosterol, β-Sitosterol, and Stigmasterol, J. Chem. Eng. Data, 2009, 54, 3, 730-734, https://doi.org/10.1021/je800395m . [all data]

Petropavlov, Tsygankova, et al., 1988
Petropavlov, N.N.; Tsygankova, I.G.; Teslenko, L.A., Microcalorimetric investigation of polymorphic transitions in organic crystals, Sov. Phys. Crystallogr., 1988, 33(6), 853-855. [all data]