Indole, 3-methyl-
- Formula: C9H9N
- Molecular weight: 131.1745
- IUPAC Standard InChIKey: ZFRKQXVRDFCRJG-UHFFFAOYSA-N
- CAS Registry Number: 83-34-1
- Chemical structure:
View 3d structure (requires JavaScript / HTML 5) - Other names: Skatole; 1H-Indole, 3-methyl-; β-Methylindole; Scatole; Skatol; 3-Methylindole; 3-MI; 3-Methyl-1H-indole; NSC 122024; 3-Methylindole (skatol); 3-methylindole (skatole); Indole, 3-methyl- (skatole)

Phase change data

Data compiled as indicated in comments:
BS - Robert L. Brown and Stephen E. Stein
TRC - Thermodynamics Research Center, NIST Boulder Laboratories, Chris Muzny director
AC - William E. Acree, Jr., James S. Chickos
Quantity | Value | Units | Method | Reference | Comment |
---|---|---|---|---|---|
Tfus | 368.25 | K | N/A | Cowley and Partington, 1936 | Uncertainty assigned by TRC = 0.6 K; TRC |
Quantity | Value | Units | Method | Reference | Comment |
ΔsubH° | 90.4 ± 1.9 | kJ/mol | C | Ribeiro da Silva, Cabral, et al., 2009 | AC |
Reduced pressure boiling point
Tboil (K) | Pressure (bar) | Reference | Comment |
---|---|---|---|
538.7 | 1.01 | Weast and Grasselli, 1989 | BS |
Enthalpy of vaporization
ΔvapH (kJ/mol) | Temperature (K) | Method | Reference | Comment |
---|---|---|---|---|
64.5 | 383. | A | Stephenson and Malanowski, 1987 | Based on data from 368. to 540. K. See also Stull, 1947.; AC |
Antoine Equation Parameters
log10(P) = A − (B / (T + C))
P = vapor pressure (bar)
T = temperature (K)
View plot Requires a JavaScript / HTML 5 canvas capable browser.
Temperature (K) | A | B | C | Reference | Comment |
---|---|---|---|---|---|
368. to 539.4 | 5.43191 | 2685.55 | -44.739 | Stull, 1947 | Coefficents calculated by NIST from author's data. |
Enthalpy of sublimation
ΔsubH (kJ/mol) | Temperature (K) | Method | Reference | Comment |
---|---|---|---|---|
83.3 | 303. | A | Stephenson and Malanowski, 1987 | Based on data from 288. to 333. K.; AC |

Normal alkane RI, polar column, temperature ramp

Data compiled by: NIST Mass Spectrometry Data Center, William E. Wallace, director

Column type CapillaryCapillaryCapillaryCapillaryCapillary
Active phase FFAPDB-WaxDB-WaxDB-FFAPHP-FFAP
Column length (m) 30.30.15.30.50.
Carrier gas HeliumHeliumHeHe
Substrate
Column diameter (mm) 0.320.320.320.320.32
Phase thickness (μm) 0.250.250.250.250.5
Tstart (C) 40. 40.40.35.
Tend (C) 240.240.230.230.230.
Heat rate (K/min) 6.6.6.6.6.
Initial hold (min) 2.  2.
Final hold (min)  5.20.5.15.
I 2484.2500.2459.2490.2500.
ReferenceChristlbauer and Schieberle, 2009Mallia, Escher, et al., 2009Kishimoto, Wanikawa, et al., 2006Sanz, Czerny, et al., 2002Preininger and Ullrich, 2001
Comment MSDC-RI MSDC-RI MSDC-RI MSDC-RI MSDC-RI

Van Den Dool and Kratz RI, polar column, custom temperature program

Data compiled by: NIST Mass Spectrometry Data Center, William E. Wallace, director

Column type CapillaryCapillaryCapillaryCapillaryCapillary
Active phase FFAPFFAPDB-FFAPFFAPFFAP
Column length (m) 25.30.30.30.50.
Carrier gas HeHe HeHe
Substrate
Column diameter (mm) 0.320.250.320.250.25
Phase thickness (μm) 0.20.250.250.250.25
Program 40C(1min) => 40C/min => 60C(1min) => 6C/min => 180C => 15C/min => 240C40C(1min) => 40C/min => 50C(2min) => 6C/min => 240C40C(2min) => 40C/min => 60C (2min) => 6C/min => 180C => 10C/min => 240C(5min)35C(2min) => 40C/min => 60C => 6C/min => 180C 20C/min => 240C(10min)20C (5min) => 2C/min => 70C => 4C/min => 210C
I 2503.2504.2514.2523.2489.
ReferenceFrauendorfer and Schieberle, 2006Jezussek, Juliano, et al., 2002Munk, Johansen, et al., 2001Zimmermann and Schieberle, 2000Yasuhara, 1987
Comment MSDC-RI MSDC-RI MSDC-RI MSDC-RI MSDC-RI

Gas phase ion energetics data

Data evaluated as indicated in comments:
L - Sharon G. Lias

Data compiled as indicated in comments:
LL - Sharon G. Lias and Joel F. Liebman
LLK - Sharon G. Lias, Rhoda D. Levin, and Sherif A. Kafafi

Quantity Value Units Method Reference Comment
IE (evaluated)7.514 ± 0.001eVN/AN/AL

Ionization energy determinations

IE (eV) Method Reference Comment
7.5143 ± 0.0006LSHager and Wallace, 1988LL
7.54 ± 0.015PEGusten, Klasinc, et al., 1976LLK

Lee's RI, non-polar column, custom temperature program

Data compiled by: NIST Mass Spectrometry Data Center, William E. Wallace, director

Column type CapillaryCapillary
Active phase Methyl SiliconeMethyl Silicone
Column length (m)
Carrier gas
Substrate
Column diameter (mm)
Phase thickness (μm)
Program not specifiednot specified
I 237.80237.88
ReferenceEckel, Ross, et al., 1993Eckel, Ross, et al., 1993
Comment MSDC-RI MSDC-RI

Normal alkane RI, non-polar column, temperature ramp

Data compiled by: NIST Mass Spectrometry Data Center, William E. Wallace, director

Column type CapillaryCapillaryCapillaryCapillaryCapillary
Active phase HP-5 MSZB-5DB-5HP-1HP-1
Column length (m) 30.30.60.50.50.
Carrier gas HeliumHeliumHeliumHeliumHelium
Substrate
Column diameter (mm) 0.250.250.320.200.20
Phase thickness (μm) 0.250.250.250.330.33
Tstart (C) 50.40. 60.60.
Tend (C) 250.280.240.250.250.
Heat rate (K/min) 5.6.6.2.2.
Initial hold (min) 0.51.
Final hold (min) 0.59.5.20.20.
I 1382.1396.1399.1351.1354.
ReferenceFanaro, Duarte, et al., 2012Harrison and Priest, 2009Mallia, Escher, et al., 2009Breme, Langle, et al., 2008Breme, Langle, et al., 2008
Comment MSDC-RI MSDC-RI MSDC-RI MSDC-RI MSDC-RI
Column type CapillaryCapillaryCapillaryCapillaryCapillary
Active phase SPB-5DB-5DB-5MSAT-1DB-5 MS
Column length (m) 60.30.30. 60.
Carrier gas HeliumHeHeHeHelium
Substrate
Column diameter (mm) 0.320.320.53 0.32
Phase thickness (μm) 1.00.251.5 0.25
Tstart (C) 30.40.40.50.40.
Tend (C) 230.230.225.300.200.
Heat rate (K/min) 3.6.6.10.3.
Initial hold (min)  2.5.2.5.
Final hold (min)  5.30. 30.
I 1408.1410.1427.1374.1401.
ReferenceSebastian, Viallon-Fernandez, et al., 2003Sanz, Czerny, et al., 2002Cadwallader and Heo, 2001Kelling, 2001Suriyaphan, Drake, et al., 1999
Comment MSDC-RI MSDC-RI MSDC-RI MSDC-RI MSDC-RI
Column type CapillaryCapillaryCapillary
Active phase HP-1DB-5Ultra-1
Column length (m) 30.30.25.
Carrier gas HeH2He
Substrate
Column diameter (mm) 0.250.320.32
Phase thickness (μm) 0.11.0.25
Tstart (C) 50.40.80.
Tend (C) 300.220.260.
Heat rate (K/min) 5.3.3.
Initial hold (min) 2.
Final hold (min) 3.
I 1362.1388.1339.
ReferenceBoatright and Crum, 1997Moio, Dekimpe, et al., 1993Okumura, 1991
Comment MSDC-RI MSDC-RI MSDC-RI

References

Cowley and Partington, 1936
Cowley, E.G.; Partington, J.R.,
Studies in dielectric polarisation. Part XV. The dipole moments of fivemembered nitrogen ring compounds: indole,skatole,carbazole,isatin, phthalimide, and succinimide.,
J. Chem. Soc., 1936, 1936, 47. [all data]
Ribeiro da Silva, Cabral, et al., 2009
Ribeiro da Silva, Manuel A.V.; Cabral, Joana I.T.A.; Gomes, José R.B.,
Combined experimental and computational study of the energetics of methylindoles,
The Journal of Chemical Thermodynamics, 2009, 41, 11, 1193-1198, https://doi.org/10.1016/j.jct.2009.05.018
. [all data]
Weast and Grasselli, 1989
CRC Handbook of Data on Organic Compounds, 2nd Editon, Weast,R.C and Grasselli, J.G., ed(s)., CRC Press, Inc., Boca Raton, FL, 1989, 1. [all data]
Stephenson and Malanowski, 1987
Stephenson, Richard M.; Malanowski, Stanislaw,
Handbook of the Thermodynamics of Organic Compounds, 1987, https://doi.org/10.1007/978-94-009-3173-2
. [all data]
Stull, 1947
Stull, Daniel R.,
Vapor Pressure of Pure Substances. Organic and Inorganic Compounds,
Ind. Eng. Chem., 1947, 39, 4, 517-540, https://doi.org/10.1021/ie50448a022
. [all data]