CAS Reg. No. 83268-51-3
- CAS Registry Number: 83268-51-3

Reaction thermochemistry data

Data compiled by: John E. Bartmess
Individual Reactions
(CAS Reg. No. 83268-51-3 • 4294967295) +
= CAS Reg. No. 83268-51-3
By formula: (CAS Reg. No. 83268-51-3 • 4294967295C3H4) + C3H4 = CAS Reg. No. 83268-51-3
Quantity | Value | Units | Method | Reference | Comment |
---|---|---|---|---|---|
ΔrH° | 106. ± 10. | kJ/mol | N/A | Bartmess and Burnham, 1984 | gas phase; value altered from reference due to change in acidity scale |

References

Bartmess and Burnham, 1984
Bartmess, J.E.; Burnham, R.,
Effect of central substituents on the gas phase acidities of propenes,
J. Org. Chem., 1984, 49, 1382. [all data]