Pindone
- Formula: C14H14O3
- Molecular weight: 230.2592
- IUPAC Standard InChIKey: RZKYEQDPDZUERB-UHFFFAOYSA-N
- CAS Registry Number: 83-26-1
- Chemical structure:

Phase change data

Data compiled by: Thermodynamics Research Center, NIST Boulder Laboratories, Chris Muzny director
Quantity | Value | Units | Method | Reference | Comment |
---|---|---|---|---|---|
Tfus | 382.88 | K | N/A | Donnelly, Drewes, et al., 1990 | Uncertainty assigned by TRC = 0.2 K |
Tfus | 382.7 | K | N/A | Plato and Glasgow, 1969 | Uncertainty assigned by TRC = 0.2 K |
Tfus | 383.0 | K | N/A | Plato and Glasgow, 1969 | Uncertainty assigned by TRC = 0.2 K |

References

Donnelly, Drewes, et al., 1990
Donnelly, J.R.; Drewes, L.A.; Johnson, R.L.; Munslow, W.D.; Knapp, K.K.; Sovocool, G.W.,
Purity and heat of fusion data for environmental standards as determined by differential scanning calorimetry,
Thermochim. Acta, 1990, 167, 2, 155, https://doi.org/10.1016/0040-6031(90)80476-F
. [all data]
Plato and Glasgow, 1969
Plato, C.; Glasgow, A.R., Jr.,
Differential scanning calorimetry as a general method for determining the purity and heat of fusion of high-purity organic chemicals. Application to 95 compounds,
Anal. Chem., 1969, 41, 2, 330, https://doi.org/10.1021/ac60271a041
. [all data]