F2CHCO2 anion
- Formula: C2HF2O2-
- Molecular weight: 95.0255
- CAS Registry Number: 83193-04-8

Reaction thermochemistry data

Data compiled as indicated in comments:
B - John E. Bartmess
M - Michael M. Meot-Ner (Mautner) and Sharon G. Lias
Individual Reactions
By formula: C2HF2O2- + H+ = C2H2F2O2
Quantity | Value | Units | Method | Reference | Comment |
---|---|---|---|---|---|
ΔrH° | 331.0 ± 2.2 | kcal/mol | G+TS | Caldwell, Renneboog, et al., 1989 | gas phase; B |
ΔrH° | 331.0 ± 2.2 | kcal/mol | G+TS | Fujio, McIver, et al., 1981 | gas phase; value altered from reference due to change in acidity scale; B |
ΔrH° | 330.7 ± 2.9 | kcal/mol | G+TS | Cumming and Kebarle, 1978 | gas phase; B |
Quantity | Value | Units | Method | Reference | Comment |
ΔrG° | 323.8 ± 2.0 | kcal/mol | IMRE | Caldwell, Renneboog, et al., 1989 | gas phase; B |
ΔrG° | 323.8 ± 2.0 | kcal/mol | IMRE | Fujio, McIver, et al., 1981 | gas phase; value altered from reference due to change in acidity scale; B |
ΔrG° | 323.5 ± 2.0 | kcal/mol | IMRE | Cumming and Kebarle, 1978 | gas phase; B |
(C2HF2O2- • ) +
= (C2HF2O2- • 2
)
By formula: (C2HF2O2- • H2O) + H2O = (C2HF2O2- • 2H2O)
Bond type: Hydrogen bond (negative ion to hydride)
Quantity | Value | Units | Method | Reference | Comment |
---|---|---|---|---|---|
ΔrH° | 12.3 ± 1.5 | kcal/mol | TDAs | Blades, Klassen, et al., 1995 | gas phase; T: 293 K. ΔSaff approx. 24 cal/mol-K; B |
Quantity | Value | Units | Method | Reference | Comment |
ΔrG° | 5.30 ± 0.30 | kcal/mol | TDAs | Blades, Klassen, et al., 1995 | gas phase; T: 293 K. ΔSaff approx. 24 cal/mol-K; B,M |
By formula: C2HF2O2- + H2O = (C2HF2O2- • H2O)
Bond type: Hydrogen bond (negative ion to hydride)
Quantity | Value | Units | Method | Reference | Comment |
---|---|---|---|---|---|
ΔrH° | 14.5 ± 1.5 | kcal/mol | TDAs | Blades, Klassen, et al., 1995 | gas phase; T: 293 K. ΔSaff approx. 24 cal/mol-K; B |
Quantity | Value | Units | Method | Reference | Comment |
ΔrG° | 7.50 ± 0.30 | kcal/mol | TDAs | Blades, Klassen, et al., 1995 | gas phase; T: 293 K. ΔSaff approx. 24 cal/mol-K; B,M |

Gas phase ion energetics data

Data compiled by: John E. Bartmess

Electron affinity of neutral species

EAneutral (eV) Method Reference Comment
4.15 ± 0.16D-EACaldwell, Renneboog, et al., 1989

Protonation reactions

C2HF2O2- + Hydrogen cation = Difluoroacetic acid

By formula: C2HF2O2- + H+ = C2H2F2O2

Quantity Value Units Method Reference Comment
Δr1385. ± 9.2kJ/molG+TSCaldwell, Renneboog, et al., 1989gas phase
Δr1385. ± 9.2kJ/molG+TSFujio, McIver, et al., 1981gas phase; value altered from reference due to change in acidity scale
Δr1384. ± 12.kJ/molG+TSCumming and Kebarle, 1978gas phase
Quantity Value Units Method Reference Comment
Δr1355. ± 8.4kJ/molIMRECaldwell, Renneboog, et al., 1989gas phase
Δr1355. ± 8.4kJ/molIMREFujio, McIver, et al., 1981gas phase; value altered from reference due to change in acidity scale
Δr1354. ± 8.4kJ/molIMRECumming and Kebarle, 1978gas phase

Ion clustering data

Data compiled as indicated in comments:
B - John E. Bartmess
M - Michael M. Meot-Ner (Mautner) and Sharon G. Lias

Clustering reactions

C2HF2O2- + Water = (C2HF2O2- • Water)

By formula: C2HF2O2- + H2O = (C2HF2O2- • H2O)

Bond type: Hydrogen bond (negative ion to hydride)

Quantity Value Units Method Reference Comment
Δr60.7 ± 6.3kJ/molTDAsBlades, Klassen, et al., 1995gas phase; T: 293 K. ΔSaff approx. 24 cal/mol-K; B
Quantity Value Units Method Reference Comment
Δr31.4 ± 1.3kJ/molTDAsBlades, Klassen, et al., 1995gas phase; T: 293 K. ΔSaff approx. 24 cal/mol-K; B,M

(C2HF2O2- • Water) + Water = (C2HF2O2- • 2Water)

By formula: (C2HF2O2- • H2O) + H2O = (C2HF2O2- • 2H2O)

Bond type: Hydrogen bond (negative ion to hydride)

Quantity Value Units Method Reference Comment
Δr51.5 ± 6.3kJ/molTDAsBlades, Klassen, et al., 1995gas phase; T: 293 K. ΔSaff approx. 24 cal/mol-K; B
Quantity Value Units Method Reference Comment
Δr22.2 ± 1.3kJ/molTDAsBlades, Klassen, et al., 1995gas phase; T: 293 K. ΔSaff approx. 24 cal/mol-K; B,M

References

Caldwell, Renneboog, et al., 1989
Caldwell, G.; Renneboog, R.; Kebarle, P.,
Gas Phase Acidities of Aliphatic Carboxylic Acids, Based on Measurements of Proton Transfer Equilibria,
Can. J. Chem., 1989, 67, 4, 661, https://doi.org/10.1139/v89-092
. [all data]
Fujio, McIver, et al., 1981
Fujio, M.; McIver, R.T., Jr.; Taft, R.W.,
Effects on the acidities of phenols from specific substituent-solvent interactions. Inherent substituent parameters from gas phase acidities,
J. Am. Chem. Soc., 1981, 103, 4017. [all data]
Cumming and Kebarle, 1978
Cumming, J.B.; Kebarle, P.,
Summary of gas phase measurements involving acids AH. Entropy changes in proton transfer reactions involving negative ions. Bond dissociation energies D(A-H) and electron affinities EA(A),
Can. J. Chem., 1978, 56, 1. [all data]
Blades, Klassen, et al., 1995
Blades, A.T.; Klassen, J.S.; Kebarle, P.,
Free Energies of Hydration in the Gas Phase on the Anions of Some Oxo Acids of C, N, S, P, Cl and I,
J. Am. Chem. Soc., 1995, 117, 42, 10563, https://doi.org/10.1021/ja00147a019
. [all data]