(Z)-9-(bicyclo[4.2.1]nonan-9-ylidene)bicyclo[4.2.1]nonane

Phase change data

Data compiled by: William E. Acree, Jr., James S. Chickos

Enthalpy of fusion

ΔfusH (kJ/mol) Temperature (K) Method Reference
11.04393.3DSCMarcos, Mel«65533»ndez, et al., 1984

References

Marcos, Mel«65533»ndez, et al., 1984
Marcos, Mercedes; Mel«65533»ndez, Enrique; Serrano, Jos«65533» Luis; Camps, Pelayo; Figueredo, Marta; Jaime, Carlos, A study on the solid?solid phase transitions of (E)- and (Z)-9-(bicyclo[4.2.1]nonan-9-ylidene)bicyclo[4.2.1]nonane and some related compounds. Assignment of the configuration to the product of monoepoxidation of (E)-9-(bicyclo[4.2.1]non-3-en-9-ylidene)bicyclo-[4.2.1]non-3-ene by 1H nuclear magnetic resonance spectroscopy using the shift reagent Eu(fod)3, J. Chem. Soc., Perkin Trans. 2, 1984, 1, 7, https://doi.org/10.1039/p29840000007 . [all data]