Propanedioic acid, phenyl-, diethyl ester
- Formula: C13H16O4
- Molecular weight: 236.2637
- IUPAC Standard InChIKey: FGYDHYCFHBSNPE-UHFFFAOYSA-N
- CAS Registry Number: 83-13-6
- Chemical structure:
View 3d structure (requires JavaScript / HTML 5) - Other names: Malonic acid, phenyl-, diethyl ester; Diethyl phenylmalonate; Phenylmalonic acid diethyl ester

Phase change data

Data compiled by: Robert L. Brown and Stephen E. Stein
Reduced pressure boiling point
Tboil (K) | Pressure (bar) | Reference |
---|---|---|
444.2 | 0.019 | Aldrich Chemical Company Inc., 1990 |

Reaction thermochemistry data

Data compiled by: John E. Bartmess
Individual Reactions
C13H15O4- + =
By formula: C13H15O4- + H+ = C13H16O4
Quantity | Value | Units | Method | Reference | Comment |
---|---|---|---|---|---|
ΔrH° | 1428. ± 9.2 | kJ/mol | G+TS | Taft, 1991 | gas phase |
Quantity | Value | Units | Method | Reference | Comment |
ΔrG° | 1403. ± 8.4 | kJ/mol | IMRE | Taft, 1991 | gas phase |

Gas phase ion energetics data

Data compiled by: John E. Bartmess
De-protonation reactions
C13H15O4- + =
By formula: C13H15O4- + H+ = C13H16O4
Quantity | Value | Units | Method | Reference | Comment |
---|---|---|---|---|---|
ΔrH° | 1428. ± 9.2 | kJ/mol | G+TS | Taft, 1991 | gas phase |
Quantity | Value | Units | Method | Reference | Comment |
ΔrG° | 1403. ± 8.4 | kJ/mol | IMRE | Taft, 1991 | gas phase |

References

Aldrich Chemical Company Inc., 1990
Aldrich Chemical Company Inc.,
Catalog Handbook of Fine Chemicals, Aldrich Chemical Company, Inc., Milwaukee WI, 1990, 1. [all data]
Taft, 1991
Taft, R.W.,
, personal communication, Aug, 1991. [all data]