Ampyrone
- Formula: C11H13N3O
- Molecular weight: 203.2404
- IUPAC Standard InChIKey: RLFWWDJHLFCNIJ-UHFFFAOYSA-N
- CAS Registry Number: 83-07-8
- Chemical structure:
View 3d structure (requires JavaScript / HTML 5) - Other names: 3H-Pyrazol-3-one, 4-amino-1,2-dihydro-1,5-dimethyl-2-phenyl-; Antipyrine, 4-amino-; Aminoantipyrin; Aminoantipyrine; Aminoazophene; Metapirazone; Solvapyrin-A; 4-Aminoantipyrene; 4-Aminoantipyrine; 4-Aminophenazone; 4-AAP; 4-Amino-2,3-dimethyl-1-phenyl-3-pyrazolin-5-one; Aminoazophenazone; Aminophenazone; 4-Amminoantipirina; 1,5-Dimethyl-2-phenyl-4-aminopyrazoline; 3-Pyrazolin-5-one, 4-amino-2,3-dimethyl-1-phenyl-; Solnapyrin-A; Aminoantipyrene; 4-Amino-1,5-dimethyl-2-phenyl-3-pyrazolone; 4-Amino-1-phenyl-2,3-dimethyl-5-pyrazolone; NSC 60242; bis-nor-Aminophenazone

Condensed phase thermochemistry data

Data compiled by: Eugene S. Domalski and Elizabeth D. Hearing
Constant pressure heat capacity of solid
Cp,solid (J/mol*K) | Temperature (K) | Reference | Comment |
---|---|---|---|
294.6 | 323. | Satoh and Sogabe, 1941 | T = 0 to 100°C. Mean value. |

Kovats' RI, non-polar column, isothermal

Data compiled by: NIST Mass Spectrometry Data Center, William E. Wallace, director

Column type Capillary
Active phase SPB-1
Column length (m) 25.
Carrier gas He
Substrate
Column diameter (mm) 0.20
Phase thickness (μm)
Temperature (C) 250.
I 1957.
ReferenceLora-Tamayo, Rams, et al., 1986
Comment MSDC-RI

References

Satoh and Sogabe, 1941
Satoh, S.; Sogabe, T.,
The heat capacities of some organic compounds containing nitrogen and the atomic heat of nitrogen. (2), Sci.,
Pap. Inst. Phys. Chem. Res. (Tokyo), 1941, 38, 231-237. [all data]