2,2-Bis(4-chlorophenyl)acetic acid
- Formula: C14H10Cl2O2
- Molecular weight: 281.134
- IUPAC Standard InChIKey: YIOCIFXUGBYCJR-UHFFFAOYSA-N
- CAS Registry Number: 83-05-6
- Chemical structure:

Phase change data

Data compiled as indicated in comments:
TRC - Thermodynamics Research Center, NIST Boulder Laboratories, Chris Muzny director
AC - William E. Acree, Jr., James S. Chickos
Quantity | Value | Units | Method | Reference | Comment |
---|---|---|---|---|---|
Tfus | 441.26 | K | N/A | Donnelly, Drewes, et al., 1990 | Uncertainty assigned by TRC = 0.2 K; TRC |
Enthalpy of fusion
ΔfusH (kcal/mol) | Temperature (K) | Method | Reference | Comment |
---|---|---|---|---|
7.567 | 440.2 | DSC | Acree, 1991 | See also Donnelly, Drewes, et al., 1990, 2.; AC |

Kovats' RI, non-polar column, isothermal

Column type | Active phase | Temperature (C) | I | Reference | Comment |
---|---|---|---|---|---|
Packed | Apiezon L | 215. | 1933. | Heinzen and Yunes, 1992 | Chromosorb W; Column length: 1.8 m |

References

Donnelly, Drewes, et al., 1990
Donnelly, J.R.; Drewes, L.A.; Johnson, R.L.; Munslow, W.D.; Knapp, K.K.; Sovocool, G.W.,
Purity and heat of fusion data for environmental standards as determined by differential scanning calorimetry,
Thermochim. Acta, 1990, 167, 2, 155, https://doi.org/10.1016/0040-6031(90)80476-F
. [all data]
Acree, 1991
Acree, William E.,
Thermodynamic properties of organic compounds: enthalpy of fusion and melting point temperature compilation,
Thermochimica Acta, 1991, 189, 1, 37-56, https://doi.org/10.1016/0040-6031(91)87098-H
. [all data]
Donnelly, Drewes, et al., 1990, 2
Donnelly, J.R.; Drewes, L.A.; Johnson, R.L.; Munslow, W.D.; Knapp, K.K.; Sovocool, G.W.,
Purity and heat of fusion data for environmental standards as determined by differential scanning calorimetry,
Thermochimica Acta, 1990, 167, 2, 155-187, https://doi.org/10.1016/0040-6031(90)80476-F
. [all data]
Heinzen and Yunes, 1992
Heinzen, V.E.F.; Yunes, R.A.,
Relationship between gas chromatographic retention indices and molecular connectivity indices of chlorinated pesticides and structurally related compounds,
J. Chromatogr., 1992, 598, 2, 243-250, https://doi.org/10.1016/0021-9673(92)85054-W
. [all data]