2-Propenoic acid, 3-(4-methoxyphenyl)-
- Formula: C10H10O3
- Molecular weight: 178.1846
- IUPAC Standard InChIKey: AFDXODALSZRGIH-QPJJXVBHSA-N
- CAS Registry Number: 830-09-1
- Chemical structure:
View 3d structure (requires JavaScript / HTML 5) - Species with the same structure:
- Stereoisomers:
- Other names: 4-Methoxycinnamic acid; p-Methoxycinnamic acid; Cinnamic acid, p-methoxy-; Cinnamic acid, 4-methoxy-; Methoxycinnamic acid, para; O-Methyl-p-coumaric acid; 3-(4-Methoxy-phenyl)-acrylic acid; 3-(4-Methoxyphenyl)-2-propenoic acid; NSC 5303; trans-4-methoxycinnamic acid

Phase change data

Data compiled as indicated in comments:
TRC - Thermodynamics Research Center, NIST Boulder Laboratories, Chris Muzny director
AC - William E. Acree, Jr., James S. Chickos
Quantity | Value | Units | Method | Reference | Comment |
---|---|---|---|---|---|
Tfus | 412. | K | N/A | Schmid and Karrer, 1945 | Uncertainty assigned by TRC = 3. K; TRC |
Enthalpy of fusion
ΔfusH (kJ/mol) | Temperature (K) | Method | Reference | Comment |
---|---|---|---|---|
2.49 | 461.9 | DSC | Huang, Chen, et al., 1994 | AC |

Condensed phase thermochemistry data

Data compiled by: Hussein Y. Afeefy, Joel F. Liebman, and Stephen E. Stein

Quantity Value Units Method Reference Comment
Δfsolid-485.8kJ/molCcbZavoianu, Ciocazan, et al., 1990
Quantity Value Units Method Reference Comment
Δcsolid-4878.1kJ/molCcbZavoianu, Ciocazan, et al., 1990Corresponding Δfsolid = -486.2 kJ/mol (simple calculation by NIST; no Washburn corrections)
Δcsolid-4871.0kJ/molCcbRoth and Stoermer, 1913Corresponding Δfsolid = -493.3 kJ/mol (simple calculation by NIST; no Washburn corrections)

References

Schmid and Karrer, 1945
Schmid, H.; Karrer, P.,
Water Soluble Extractives of Papaver Somniferum L. I.,
Helv. Chim. Acta, 1945, 28, 742. [all data]
Huang, Chen, et al., 1994
Huang, Wei-Jun; Chen, Su-Ming; Tan, Fu; Yang, Zhen-Xiang,
Study on Thermodynamic Characteristics of Cinnamic Acid Derivatives,
Acta Phys. Chim. Sin., 1994, 10, 2, 151-153, https://doi.org/10.3866/PKU.WHXB19940212
. [all data]