Chlorcyclizine

Normal alkane RI, non-polar column, temperature ramp

Data compiled by: NIST Mass Spectrometry Data Center, William E. Wallace, director

Column type CapillaryPackedPacked
Active phase HP-1OV-1SE-30
Column length (m) 12.2.2.
Carrier gas He
Substrate  Gas Chrom PGas Chrom P
Column diameter (mm) 0.20
Phase thickness (μm) 0.33
Tstart (C) 100.120.120.
Tend (C) 310.200.200.
Heat rate (K/min) 30.2.52.5
Initial hold (min) 3.
Final hold (min) 5.
I 2220.2230.2240.
ReferenceMaurer and Pfleger, 1988Marozzi, Gambaro, et al., 1982Marozzi, Gambaro, et al., 1982
Comment MSDC-RI MSDC-RI MSDC-RI

Normal alkane RI, non-polar column, custom temperature program

Data compiled by: NIST Mass Spectrometry Data Center, William E. Wallace, director

Column type Other
Active phase Methyl Silicone
Column length (m)
Carrier gas
Substrate
Column diameter (mm)
Phase thickness (μm)
Program not specified
I 2225.
ReferenceArdrey and Moffat, 1981
Comment MSDC-RI

References

Maurer and Pfleger, 1988
Maurer, H.; Pfleger, K., Toxicological detection of ethylenediamine and piperazine antihistamines and their metabolites in urine by computerized gas chromatography-mass spectrometry, Fresenius Z. Anal. Chem., 1988, 331, 7, 744-756, https://doi.org/10.1007/BF01105612 . [all data]

Marozzi, Gambaro, et al., 1982
Marozzi, E.; Gambaro, V.; Saligari, E.; Mariani, R.; Lodi, F., Use of the retention index in gas chromatographic studies of drugs, J. Anal. Toxicol., 1982, 6, 4, 185-192, https://doi.org/10.1093/jat/6.4.185 . [all data]