2',4'-Dimethoxyacetophenone
- Formula: C10H12O3
- Molecular weight: 180.2005
- IUPAC Standard InChIKey: VQTDPCRSXHFMOL-UHFFFAOYSA-N
- CAS Registry Number: 829-20-9
- Chemical structure:
View 3d structure (requires JavaScript / HTML 5) - Other names: 2,4-Dimethoxyacetophenone; Ethanone, 1-(2,4-dimethoxyphenyl)-; Acetophenone, 2',4'-dimethoxy-; 1-(2,4-Dimethoxy-phenyl)-ethanone; Resacetophenone dimethyl ether; 2',4'-Dihydroxyacetophenone, dimethyl ether; 1-(2,4-dimethoxyphenyl)ethan-1-one

Phase change data

Data compiled by: Robert L. Brown and Stephen E. Stein
Quantity | Value | Units | Method | Reference | Comment |
---|---|---|---|---|---|
Tboil | 561.2 | K | N/A | Aldrich Chemical Company Inc., 1990 |

Van Den Dool and Kratz RI, non-polar column, temperature ramp

Column type | Active phase | I | Reference | Comment |
---|---|---|---|---|
Capillary | VF-5MS | 1593. | Todua, 2011 | 30. m/0.25 mm/0.25 μm, He; Tstart: 60. C; Tend: 270. C |

Van Den Dool and Kratz RI, non-polar column, custom temperature program

Column type | Active phase | I | Reference | Comment |
---|---|---|---|---|
Capillary | VF-5MS | 1586.3 | Tret'yakov, 2008 | 30. m/0.25 mm/0.25 μm, He; Program: Multi-step temperature program; T(initial)=60C; T(final)=270C |

References

Aldrich Chemical Company Inc., 1990
Aldrich Chemical Company Inc.,
Catalog Handbook of Fine Chemicals, Aldrich Chemical Company, Inc., Milwaukee WI, 1990, 1. [all data]
Todua, 2011
Todua, N.G.,
Retention Data. NIST Mass Spectrometry Data Center., NIST Mass Spectrometry Data Center, 2011. [all data]
Tret'yakov, 2008
Tret'yakov, K.V.,
Retention Data. NIST Mass Spectrometry Data Center., NIST Mass Spectrometry Data Center, 2008. [all data]