Alpha,N,N-dimethylaminophenylacetonitrile
- Formula: C10H12N2
- Molecular weight: 160.2157
- IUPAC Standard InChIKey: PAGHXXKYFBGJEH-UHFFFAOYSA-N
- CAS Registry Number: 827-36-1
- Chemical structure:
View 3d structure (requires JavaScript / HTML 5) - Permanent link for this species. Use this link for bookmarking this species for future reference.

Gas phase thermochemistry data

Data compiled by: Hussein Y. Afeefy, Joel F. Liebman, and Stephen E. Stein
Quantity | Value | Units | Method | Reference | Comment |
---|---|---|---|---|---|
ΔfH°gas | 220.32 ± 0.81 | kJ/mol | Ccb | Welle, Verevkin, et al., 1997 |

Condensed phase thermochemistry data

Data compiled by: Hussein Y. Afeefy, Joel F. Liebman, and Stephen E. Stein
Quantity | Value | Units | Method | Reference | Comment |
---|---|---|---|---|---|
ΔfH°liquid | 157.53 ± 0.68 | kJ/mol | Ccb | Welle, Verevkin, et al., 1997 | |
Quantity | Value | Units | Method | Reference | Comment |
ΔcH°liquid | -5807.60 ± 0.56 | kJ/mol | Ccb | Welle, Verevkin, et al., 1997 |

Phase change data

Data compiled as indicated in comments:
BS - Robert L. Brown and Stephen E. Stein
ALS - Hussein Y. Afeefy, Joel F. Liebman, and Stephen E. Stein
DRB - Donald R. Burgess, Jr.
AC - William E. Acree, Jr., James S. Chickos
Quantity | Value | Units | Method | Reference | Comment |
---|---|---|---|---|---|
ΔvapH° | 62.79 ± 0.43 | kJ/mol | V | Welle, Verevkin, et al., 1997 | ALS |
ΔvapH° | 62.8 | kJ/mol | N/A | Welle, Verevkin, et al., 1997 | DRB |
Reduced pressure boiling point
Tboil (K) | Pressure (bar) | Reference | Comment |
---|---|---|---|
351. to 352. | 0.001 | Frinton Laboratories Inc., 1986 | BS |
Enthalpy of vaporization
ΔvapH (kJ/mol) | Temperature (K) | Method | Reference | Comment |
---|---|---|---|---|
62.8 ± 0.4 | 298. to 338. | GS | Welle, Verevkin, et al., 1997 | AC |

References

Welle, Verevkin, et al., 1997
Welle, F.M.; Verevkin, S.P.; Beckhaus, H.-D.; Ruchardt, C.,
Stabilization of the cyano(dimethylamino)methyl radical - synergistic effect due to interaction between α-cyano groups on the radical stabilization energy,
Liebigs Ann., 1997, 155-163. [all data]
Frinton Laboratories Inc., 1986
Frinton Laboratories Inc.,
Catalog Number 11, Frinton Laboratories Inc., Vineland, NJ, 1986, 99. [all data]