C7H10O4
- Formula: C7H10O4
- Molecular weight: 158.1519
- IUPAC Standard InChIKey: JBVOSZYUSFDYIN-UHFFFAOYSA-N
- CAS Registry Number: 826-34-6
- Chemical structure:
View 3d structure (requires JavaScript / HTML 5) - Stereoisomers:

Reaction thermochemistry data

Data compiled by: John E. Bartmess
Individual Reactions
C7H9O4- + =
By formula: C7H9O4- + H+ = C7H10O4
Quantity | Value | Units | Method | Reference | Comment |
---|---|---|---|---|---|
ΔrH° | 1569. ± 15. | kJ/mol | G+TS | Chou, Dahlke, et al., 1993 | gas phase |
Quantity | Value | Units | Method | Reference | Comment |
ΔrG° | 1535. ± 15. | kJ/mol | IMRB | Chou, Dahlke, et al., 1993 | gas phase |

Gas phase ion energetics data

Data compiled by: John E. Bartmess
De-protonation reactions
C7H9O4- + =
By formula: C7H9O4- + H+ = C7H10O4
Quantity | Value | Units | Method | Reference | Comment |
---|---|---|---|---|---|
ΔrH° | 1569. ± 15. | kJ/mol | G+TS | Chou, Dahlke, et al., 1993 | gas phase |
Quantity | Value | Units | Method | Reference | Comment |
ΔrG° | 1535. ± 15. | kJ/mol | IMRB | Chou, Dahlke, et al., 1993 | gas phase |

References

Chou, Dahlke, et al., 1993
Chou, P.K.; Dahlke, G.D.; Kass, S.R.,
Unimolecular Rearrangements of Carbanions in the Gas Phase .2. Cyclopropyl Anions,
J. Chem. Soc. Chem. Comm., 1993, 115, 1, 315, https://doi.org/10.1021/ja00054a045
. [all data]