Zolpidem
- Formula: C19H21N3O
- Molecular weight: 307.3895
- IUPAC Standard InChIKey: ZAFYATHCZYHLPB-UHFFFAOYSA-N
- CAS Registry Number: 82626-48-0
- Chemical structure:
View 3d structure (requires JavaScript / HTML 5) - Other names: Ambien; N,N,6-Trimethyl-2-p-tolylimidazo[1,2-a]pyridine-3-acetamide; SL-800750; Ambien CR; N,N-Dimethyl-2-[6-methyl-2-(4-methylphenyl)imidazo[1,2-a]pyridin-3-yl]acetamide; Imidazo[1,2-a]pyridine-3-acetamide, N,N,6-trimethyl-2-(4-methylphenyl)-; N, N-Dimethyl-2- (6-Methyl-2 (4-methylphenyl) imidazo [1,2-a] pyridin-3-YI) acetamide; Imidazol[1,2-a]pyridine-3-acetamide, N,N,6-trimethyl-2-(4-methylphenyl)-

Kovats' RI, non-polar column, isothermal

Column type | Active phase | Temperature (C) | I | Reference | Comment |
---|---|---|---|---|---|
Capillary | Ultra-1 | 250. | 2788. | Ahrens, Schütz, et al., 1994 | 12. m/0.2 mm/0.33 μm, N2 |

Van Den Dool and Kratz RI, non-polar column, temperature ramp

Column type | Active phase | I | Reference | Comment |
---|---|---|---|---|
Capillary | VF-5MS | 2908.2 | Tretyakov, 2014 | 30. m/0.25 mm/0.25 μm, He; Tstart: 60. C; Tend: 270. C |

References

Ahrens, Schütz, et al., 1994
Ahrens, B.; Schütz, H.; Seno, H.; Weiler, G.,
Screening, identification and determination of the two new hypnotics zolpidem and zopiclone,
Arzneim. Forsch., 1994, 44, 7, 799-802. [all data]
Tretyakov, 2014
Tretyakov, K.V.,
Retention Data. NIST Mass Spectrometry Data Center., NIST Mass Spectrometry Data Center, 2014. [all data]