2-Methylbicyclo[2.2.1]-5-heptene-2-carboxylic acid
- Formula: C9H12O2
- Molecular weight: 152.1904
- IUPAC Standard InChIKey: JIHFJSOMLKXSSQ-UHFFFAOYSA-N
- CAS Registry Number: 825-03-6
- Chemical structure:
View 3d structure (requires JavaScript / HTML 5) - Permanent link for this species. Use this link for bookmarking this species for future reference.

Phase change data

Data compiled by: Robert L. Brown and Stephen E. Stein
Reduced pressure boiling point
Tboil (K) | Pressure (bar) | Reference |
---|---|---|
383. to 385. | 0.0033 | Frinton Laboratories Inc., 1986 |

References

Frinton Laboratories Inc., 1986
Frinton Laboratories Inc.,
Catalog Number 11, Frinton Laboratories Inc., Vineland, NJ, 1986, 99. [all data]