1-Phenyl-1-butene
- Formula: C10H12
- Molecular weight: 132.2023
- IUPAC Standard InChIKey: MPMBRWOOISTHJV-UHFFFAOYSA-N
- CAS Registry Number: 824-90-8
- Chemical structure:
View 3d structure (requires JavaScript / HTML 5) - Stereoisomers:
- Other names: Benzene, 1-butenyl; β-Ethylstyrene; 1-Butenyl-benzene

Condensed phase thermochemistry data

Data compiled by: Hussein Y. Afeefy, Joel F. Liebman, and Stephen E. Stein
Quantity | Value | Units | Method | Reference | Comment |
---|---|---|---|---|---|
ΔcH°liquid | -5639.6 | kJ/mol | Ccb | Auwsers, Roth, et al., 1910 | Corresponding ΔfHºliquid = -10. kJ/mol (simple calculation by NIST; no Washburn corrections) |

Phase change data

Data compiled by: Thermodynamics Research Center, NIST Boulder Laboratories, Chris Muzny director
Quantity | Value | Units | Method | Reference | Comment |
---|---|---|---|---|---|
Tboil | 463. ± 20. | K | AVG | N/A | Average of 6 values; Individual data points |
Quantity | Value | Units | Method | Reference | Comment |
Tfus | 230.09 | K | N/A | Boord, Henne, et al., 1949 | Uncertainty assigned by TRC = 0.5 K |
Tfus | 230.09 | K | N/A | Boord, Greenlee, et al., 1946 | Uncertainty assigned by TRC = 0.2 K |

Kovats' RI, non-polar column, isothermal

Column type | Active phase | Temperature (C) | I | Reference | Comment |
---|---|---|---|---|---|
Capillary | OV-101 | 100. | 1112. | Engewald, Topalova, et al., 1987 | Column length: 50. m; Column diameter: 0.30 mm |
Capillary | SE-30 | 65. | 1098.2 | Svob and Deur-Siftar, 1974 | He; Column length: 25.5 m; Column diameter: 0.5 mm |

Normal alkane RI, non-polar column, temperature ramp

Column type | Active phase | I | Reference | Comment |
---|---|---|---|---|
Capillary | OV-101 | 1078. | Mandelshtam, Kharicheva, et al., 1991 | Helium, 50. C @ 0. min, 3. K/min, 220. C @ 0. min; Column length: 54. m; Column diameter: 0.26 mm |

Normal alkane RI, non-polar column, custom temperature program

Column type | Active phase | I | Reference | Comment |
---|---|---|---|---|
Capillary | OV-1, SE-30, Methyl silicone, SP-2100, OV-101, DB-1, etc. | 1098. | Waggott and Davies, 1984 | Hydrogen; Column length: 50. m; Column diameter: 0.32 mm; Program: not specified |

References

Auwsers, Roth, et al., 1910
Auwsers, K.; Roth, W.A.; Eisenlohr, F.,
III. Verbrennungswarmen von Terpenen und Styrolen,
Justus Liebigs Ann. Chem., 1910, 267-290. [all data]
Boord, Henne, et al., 1949
Boord, C.E.; Henne, A.L.; Greenlee, K.W.; Perilstein, W.L.; Derfer, J.M.,
The Grignard Reagent in hydrocarbon synthesis,
Ind. Eng. Chem., 1949, 41, 609. [all data]
Boord, Greenlee, et al., 1946
Boord, C.E.; Greenlee, K.W.; Perilstein, W.L.,
The Synthesis, Purification and Prop. of Hydrocarbons of Low Mol. Weight, Am. Pet. Inst. Res. Proj. 45, Eighth Annu. Rep., Ohio State Univ., June 30, 1946. [all data]
Engewald, Topalova, et al., 1987
Engewald, W.; Topalova, I.; Petsev, N.; Dimitrov, Chr.,
Structure-Retention Correlations of Hydrocarbons in GLC and GSC. Alkenylbenzenes,
Chromatographia, 1987, 23, 8, 561-565, https://doi.org/10.1007/BF02324864
. [all data]
Svob and Deur-Siftar, 1974
Svob, V.; Deur-Siftar, D.,
Kovats Retention Indices in the Identification of Alkylbenzene Degradation Products,
J. Chromatogr., 1974, 91, 677-689, https://doi.org/10.1016/S0021-9673(01)97947-6
. [all data]
Mandelshtam, Kharicheva, et al., 1991
Mandelshtam, T.V.; Kharicheva, E.M.; Gorobets, I.A.; Zenkevich, I.G.; Kostikov, R.R.; Porokhovnikova, E.B.,
Synthesis and Chromato Mass Spectrometric Investigation of alpha-Alkoxystyrenes,
Zh. Org. Khim. (Rus.), 1991, 27, 4, 684-690. [all data]
Waggott and Davies, 1984
Waggott, A.; Davies, I.W.,
Identification of organic pollutants using linear temperature programmed retention indices (LTPRIs) - Part II, 1984, retrieved from http://dwi.defra.gov.uk/research/completed-research/reports/dwi0383.pdf. [all data]