1,4-Benzenediol, 2,5-dichloro-
- Formula: C6H4Cl2O2
- Molecular weight: 179.001
- IUPAC Standard InChIKey: AYNPIRVEWMUJDE-UHFFFAOYSA-N
- CAS Registry Number: 824-69-1
- Chemical structure:
View 3d structure (requires JavaScript / HTML 5) - Other names: Hydroquinone, 2,5-dichloro-; 2,5-Dichloro-p-benzohydroquinone; 2,5-Dichloro-p-hydroquinone; 2,5-Dichloro-1,4-hydroquinone; 2,5-Dichlorohydroquinone; 2,5-Dichloro-1,4-benzenediol; 2,5-Dichloro-1,4-dihydroxybenzene

Condensed phase thermochemistry data

Data compiled by: Hussein Y. Afeefy, Joel F. Liebman, and Stephen E. Stein
Quantity | Value | Units | Method | Reference | Comment |
---|---|---|---|---|---|
ΔfH°solid | -437.6 | kJ/mol | Ccb | Sjostrom, 1936 | At 318 K |
Quantity | Value | Units | Method | Reference | Comment |
ΔcH°solid | -2552.7 ± 8.4 | kJ/mol | Ccb | Smith, Bjellerup, et al., 1953 | Reanalyzed by Cox and Pilcher, 1970, Original value = -2554.1 ± 4.6 kJ/mol |
ΔcH°solid | -2547. | kJ/mol | Ccb | Sjostrom, 1936 | At 318 K |

References

Sjostrom, 1936
Sjostrom, Av.G.,
De klorsubstituerade kinonernas och hydrokinonernas termokemi,
Svensk. Kim. Tidr., 1936, 48, 121-124. [all data]
Smith, Bjellerup, et al., 1953
Smith, L.; Bjellerup, L.; Krook, S.; Westermark, H.,
Heats of combustion of organic chloro compounds determined by the "quartz wool" method,
Acta Chem. Scand., 1953, 7, 65. [all data]
Cox and Pilcher, 1970
Cox, J.D.; Pilcher, G.,
Thermochemistry of Organic and Organometallic Compounds, Academic Press, New York, 1970, 1-636. [all data]