Bicyclo(2.2.1)heptane-2-carboxylic acid
- Formula: C8H12O2
- Molecular weight: 140.1797
- IUPAC Standard InChIKey: JESWDXIHOJGWBP-UHFFFAOYSA-N
- CAS Registry Number: 824-62-4
- Chemical structure:
View 3d structure (requires JavaScript / HTML 5) - Stereoisomers:
- Other names: 2-Norbornanecarboxylic acid; endo-Bicyclo(2.2.1)heptane-2-carboxylic acid; Bicyclo(2,2,1)heptane-2-carboxylic acid

Phase change data

Data compiled by: Robert L. Brown and Stephen E. Stein
Reduced pressure boiling point
Tboil (K) | Pressure (bar) | Reference |
---|---|---|
407. to 408. | 0.021 | Frinton Laboratories Inc., 1986 |

References

Frinton Laboratories Inc., 1986
Frinton Laboratories Inc.,
Catalog Number 11, Frinton Laboratories Inc., Vineland, NJ, 1986, 99. [all data]