2,5-Dimethylbenzyl chloride
- Formula: C9H11Cl
- Molecular weight: 154.637
- IUPAC Standard InChIKey: PECXPZGFZFGDRD-UHFFFAOYSA-N
- CAS Registry Number: 824-45-3
- Chemical structure:
View 3d structure (requires JavaScript / HTML 5) - Other names: Benzene, 2-(chloromethyl)-1,4-dimethyl-; 1-Chloromethyl-2,5-dimethylbenzene; 1,4-Dimethyl-2-(chloromethyl)benzene; 2-Chloromethyl-p-xylene

Phase change data

Data compiled by: Robert L. Brown and Stephen E. Stein
Quantity | Value | Units | Method | Reference | Comment |
---|---|---|---|---|---|
Tboil | 496.7 | K | N/A | Aldrich Chemical Company Inc., 1990 |

Normal alkane RI, non-polar column, temperature ramp

Column type | Active phase | I | Reference | Comment |
---|---|---|---|---|
Capillary | OV-101 | 1231. | Zenkevich and Makarov, 2007 | N2, 6. K/min; Column length: 25. m; Column diameter: 0.2 mm; Tstart: 60. C; Tend: 240. C |
Capillary | OV-101 | 1228. | Zenkevich, 2001 | N2, 4. K/min; Column length: 25. m; Column diameter: 0.20 mm; Tstart: 60. C; Tend: 240. C |

References

Aldrich Chemical Company Inc., 1990
Aldrich Chemical Company Inc.,
Catalog Handbook of Fine Chemicals, Aldrich Chemical Company, Inc., Milwaukee WI, 1990, 1. [all data]
Zenkevich and Makarov, 2007
Zenkevich, I.G.; Makarov, A.A.,
Identification of Alkylarene Chloromethylation Products Using Gas-Chromatographic Retention Indices,
Russian Journal of General Chemistry, 2007, 77, 4, 611-619, https://doi.org/10.1134/S1070363207040196
. [all data]
Zenkevich, 2001
Zenkevich, I.G.,
Interpretation of Gas Chromatographic Retention Indices in estimation of Structures of Isomeric Products of Radical Chlorinating of Alkyl Arenes,
Zh. Org. Khim., 2001, 37, 2, 283-293. [all data]