Trimethylolpropane phosphite
- Formula: C6H11O3P
- Molecular weight: 162.1235
- IUPAC Standard InChIKey: QRUSNTDXJQBKBI-UHFFFAOYSA-N
- CAS Registry Number: 824-11-3
- Chemical structure:

Phase change data

Data compiled by: Robert L. Brown and Stephen E. Stein
Reduced pressure boiling point
Tboil (K) | Pressure (bar) | Reference |
---|---|---|
371. to 373. | 0.003 | Frinton Laboratories Inc., 1986 |

Van Den Dool and Kratz RI, non-polar column, temperature ramp

Column type | Active phase | I | Reference | Comment |
---|---|---|---|---|
Capillary | SE-54 | 1221. | Kostiainen, 2000 | 25. m/0.32 mm/0.25 μm, He, 40. C @ 1. min, 10. K/min, 280. C @ 10. min |

References

Frinton Laboratories Inc., 1986
Frinton Laboratories Inc.,
Catalog Number 11, Frinton Laboratories Inc., Vineland, NJ, 1986, 99. [all data]
Kostiainen, 2000
Kostiainen, O.,
Gas Chromatography in Screening of Chemicals Related to the Chemical Weapons Convention
in Encyclopedia of Analytical Chemistry, Meyers, R.A., ed(s)., John Wiley Sons Ltd, Chichester, 2000, 963-979. [all data]