Nonanoic acid, TMS derivative
- Formula: C12H26O2Si
- Molecular weight: 230.4191
- IUPAC Standard InChIKey: ISTGUORKGWWKMI-UHFFFAOYSA-N
- CAS Registry Number: 82326-11-2
- Chemical structure:
View 3d structure (requires JavaScript / HTML 5) - Other names: Nonanoic acid, trimethylsilyl ester; Nonanoic acid, TMS ester

Van Den Dool and Kratz RI, non-polar column, temperature ramp

Column type | Active phase | I | Reference | Comment |
---|---|---|---|---|
Packed | OV-1 | 1355. | Tanaka, Hine, et al., 1980 | N2, 100-120 mesh, 70. C @ 0.5 min, 28. K/min; Column length: 1.8 m; Tend: 290. C |

Van Den Dool and Kratz RI, non-polar column, custom temperature program

Column type | Active phase | I | Reference | Comment |
---|---|---|---|---|
Capillary | VF-5MS | 1354.8 | Tret'yakov, 2007 | 30. m/0.25 mm/0.25 μm, He; Program: Multi-step temperature program; T(initial)=60C; T(final)=270C |
Capillary | Methyl Silicone | 1358. | Peng, Yang, et al., 1991 | Program: not specified |
Packed | OV-101 | 1355. | Tanaka and Hine, 1982 | Program: not specified |

Normal alkane RI, non-polar column, temperature ramp

Column type | Active phase | I | Reference | Comment |
---|---|---|---|---|
Capillary | HP-5 | 1355. | Isidorov, Kotowska, et al., 2005 | 30. m/0.25 mm/0.25 μm, He; Tstart: 50. C; Tend: 300. C |

Normal alkane RI, non-polar column, custom temperature program

Column type | Active phase | I | Reference | Comment |
---|---|---|---|---|
Capillary | RTx-5 Sil MS | 1369. | Birkemeier and Kopka, 2007 | 30. m/0.25 mm/0.25 μm, Helium; Program: 70 0C (1 min) 1 0C/min -> 76 0C 6.09 0C/min -> 350 0C (1 min) -> 330 0C (10 min) |

References

Tanaka, Hine, et al., 1980
Tanaka, K.; Hine, D.G.; West-Dull, A.; Lynn, T.B.,
Gas-chromatographic method of analysis for urinary organic acids. I. Retention indices of 155 metabolically important compounds,
Clin. Chem., 1980, 26, 13, 1839-1846. [all data]
Tret'yakov, 2007
Tret'yakov, K.V.,
Retention Data. NIST Mass Spectrometry Data Center., NIST Mass Spectrometry Data Center, 2007. [all data]
Peng, Yang, et al., 1991
Peng, C.T.; Yang, Z.C.; Maltby, D.,
Prediction of retention indexes. III. Silylated derivatives of polar compounds,
J. Chromatogr., 1991, 586, 1, 113-129, https://doi.org/10.1016/0021-9673(91)80029-G
. [all data]
Tanaka and Hine, 1982
Tanaka, K.; Hine, D.G.,
Compilation of Gas Chromatographic Retention Indices of 163 Metabolically Important Organic Acids, and Their Use in Detection of Patients with Organic Acidurias,
J. Chromatogr., 1982, 239, 301-322, https://doi.org/10.1016/S0021-9673(00)81990-1
. [all data]
Isidorov, Kotowska, et al., 2005
Isidorov, V.A.; Kotowska, U.; Vinogorova, V.T.,
GC Identification of organic compounds based on partition coefficients of their TMS derivatives in a hexane-acetonitrile system and retention indices,
Anal. Sci., 2005, 21, 12, 1483-1489, https://doi.org/10.2116/analsci.21.1483
. [all data]
Birkemeier and Kopka, 2007
Birkemeier, C.; Kopka, J.,
Design of metabolite recovery by variations of the metabolite profiling protocol
in Concepts in Plant Metabolomics, Nikolau, B.J.; Wurtele, E.S., ed(s)., Springer, Dordrecht, Netheralnds, 2007, 45-69. [all data]