Phenyl mercuric iodide
- Formula: C6H5HgI
- Molecular weight: 404.60
- IUPAC Standard InChIKey: BISBXZWWFIOZSX-UHFFFAOYSA-M
- CAS Registry Number: 823-04-1
- Chemical structure:

Reaction thermochemistry data

Data compiled by: José A. Martinho Simões
Individual Reactions
By formula: C12H10Hg (l) + HgI2 (cr) = 2C6H5HgI (cr)
Quantity | Value | Units | Method | Reference | Comment |
---|---|---|---|---|---|
ΔrH° | -5.2 ± 0.2 | kcal/mol | RSC | Hartley, Pritchard, et al., 1951 | Please also see Pedley and Rylance, 1977 and Cox and Pilcher, 1970. |

Condensed phase thermochemistry data

Data compiled by: José A. Martinho Simões

Quantity Value Units Method Reference Comment
Δfsolid77.1 ± 3.0kJ/molReviewMartinho SimõesThe enthalpy of formation relies on 281.4 ± 5.6 kJ/mol for the enthalpy of formation of Hg(Ph)2(l).

References

Hartley, Pritchard, et al., 1951
Hartley, K.; Pritchard, H.O.; Skinner, H.A.,
Thermochemistry of metallic alkyls. IV. Mercury diethyl and mercury diphenyl,
Trans. Faraday Soc., 1951, 47, 254, https://doi.org/10.1039/tf9514700254
. [all data]
Pedley and Rylance, 1977
Pedley, J.B.; Rylance, J.,
Computer Analysed Thermochemical Data: Organic and Organometallic Compounds, University of Sussex, Brigton, 1977. [all data]
Cox and Pilcher, 1970
Cox, J.D.; Pilcher, G.,
Thermochemistry of Organic and Organometallic Compounds
in Academic Press, New York, 1970. [all data]