Cyclohexanone, 2-chloro-
- Formula: C6H9ClO
- Molecular weight: 132.588
- IUPAC Standard InChIKey: CCHNWURRBFGQCD-UHFFFAOYSA-N
- CAS Registry Number: 822-87-7
- Chemical structure:
View 3d structure (requires JavaScript / HTML 5) - Other names: α-Chlorocyclohexanone; 2-Chlorocyclohexanone

Phase change data

Data compiled by: Robert L. Brown and Stephen E. Stein
Reduced pressure boiling point
Tboil (K) | Pressure (bar) | Reference |
---|---|---|
355.7 | 0.013 | Aldrich Chemical Company Inc., 1990 |
365. to 369. | 0.021 | Frinton Laboratories Inc., 1986 |

Normal alkane RI, non-polar column, temperature ramp

Column type | Active phase | I | Reference | Comment |
---|---|---|---|---|
Capillary | OV-101 | 1026. | Zenkevich, Eliseenkov, et al., 2011 | 25. m/0.20 mm/0.25 μm, Nitrogen, 6. K/min; Tstart: 40. C; Tend: 240. C |

References

Aldrich Chemical Company Inc., 1990
Aldrich Chemical Company Inc.,
Catalog Handbook of Fine Chemicals, Aldrich Chemical Company, Inc., Milwaukee WI, 1990, 1. [all data]
Frinton Laboratories Inc., 1986
Frinton Laboratories Inc.,
Catalog Number 11, Frinton Laboratories Inc., Vineland, NJ, 1986, 99. [all data]
Hayes, 1966
Hayes, W.P.,
UV atlas of organic compounds, 1966, 1, B1/4. [all data]
Zenkevich, Eliseenkov, et al., 2011
Zenkevich, I.G.; Eliseenkov, E.V.; Kasatochkin, A.N.; Zhakovskaya, Z.A.; Khoroshko, L.O.,
Gas chromatographic identification of chlorination products of aliphatic ketones,
J. Chromatogr., 2011, 1218, 21, 3291-3299, https://doi.org/10.1016/j.chroma.2010.12.056
. [all data]